tez-dev mailing list archives

Site index · List index
Message view « Date » · « Thread »
Top « Date » · « Thread »
From Apache Jenkins Server <jenk...@builds.apache.org>
Subject Build failed in Jenkins: Tez-Build #96
Date Sun, 11 Aug 2013 22:51:21 GMT
See <https://builds.apache.org/job/Tez-Build/96/changes>

Changes:

[hitesh] TEZ-353. Dump out MR task configs to logs in debug mode. (hitesh)

------------------------------------------
[...truncated 1808 lines...]
[ERROR] <https://builds.apache.org/job/Tez-Build/ws/tez-dag-api/target/generated-sources/java/org/apache/tez/dag/api/client/rpc/DAGClientAMProtocolRPC.java>:[3756,37]
cannot find symbol
[ERROR] symbol  : class Parser
[ERROR] location: package com.google.protobuf
[ERROR] <https://builds.apache.org/job/Tez-Build/ws/tez-dag-api/target/generated-sources/java/org/apache/tez/dag/api/client/rpc/DAGClientAMProtocolRPC.java>:[3767,30]
cannot find symbol
[ERROR] symbol  : class Parser
[ERROR] location: package com.google.protobuf
[ERROR] <https://builds.apache.org/job/Tez-Build/ws/tez-dag-api/target/generated-sources/java/org/apache/tez/dag/api/records/DAGProtos.java>:[13851,37]
cannot find symbol
[ERROR] symbol  : class Parser
[ERROR] location: package com.google.protobuf
[ERROR] <https://builds.apache.org/job/Tez-Build/ws/tez-dag-api/target/generated-sources/java/org/apache/tez/dag/api/records/DAGProtos.java>:[13862,30]
cannot find symbol
[ERROR] symbol  : class Parser
[ERROR] location: package com.google.protobuf
[ERROR] <https://builds.apache.org/job/Tez-Build/ws/tez-dag-api/target/generated-sources/java/org/apache/tez/dag/api/records/DAGProtos.java>:[12254,37]
cannot find symbol
[ERROR] symbol  : class Parser
[ERROR] location: package com.google.protobuf
[ERROR] <https://builds.apache.org/job/Tez-Build/ws/tez-dag-api/target/generated-sources/java/org/apache/tez/dag/api/records/DAGProtos.java>:[12265,30]
cannot find symbol
[ERROR] symbol  : class Parser
[ERROR] location: package com.google.protobuf
[ERROR] <https://builds.apache.org/job/Tez-Build/ws/tez-dag-api/target/generated-sources/java/org/apache/tez/dag/api/records/DAGProtos.java>:[11452,37]
cannot find symbol
[ERROR] symbol  : class Parser
[ERROR] location: package com.google.protobuf
[ERROR] <https://builds.apache.org/job/Tez-Build/ws/tez-dag-api/target/generated-sources/java/org/apache/tez/dag/api/records/DAGProtos.java>:[11463,30]
cannot find symbol
[ERROR] symbol  : class Parser
[ERROR] location: package com.google.protobuf
[ERROR] <https://builds.apache.org/job/Tez-Build/ws/tez-dag-api/target/generated-sources/java/org/apache/tez/dag/api/records/DAGProtos.java>:[13057,37]
cannot find symbol
[ERROR] symbol  : class Parser
[ERROR] location: package com.google.protobuf
[ERROR] <https://builds.apache.org/job/Tez-Build/ws/tez-dag-api/target/generated-sources/java/org/apache/tez/dag/api/records/DAGProtos.java>:[13068,30]
cannot find symbol
[ERROR] symbol  : class Parser
[ERROR] location: package com.google.protobuf
[ERROR] <https://builds.apache.org/job/Tez-Build/ws/tez-dag-api/target/generated-sources/java/org/apache/tez/dag/api/records/DAGProtos.java>:[847,37]
cannot find symbol
[ERROR] symbol  : class Parser
[ERROR] location: package com.google.protobuf
[ERROR] <https://builds.apache.org/job/Tez-Build/ws/tez-dag-api/target/generated-sources/java/org/apache/tez/dag/api/records/DAGProtos.java>:[858,30]
cannot find symbol
[ERROR] symbol  : class Parser
[ERROR] location: package com.google.protobuf
[ERROR] <https://builds.apache.org/job/Tez-Build/ws/tez-dag-api/target/generated-sources/java/org/apache/tez/dag/api/records/DAGProtos.java>:[1641,37]
cannot find symbol
[ERROR] symbol  : class Parser
[ERROR] location: package com.google.protobuf
[ERROR] <https://builds.apache.org/job/Tez-Build/ws/tez-dag-api/target/generated-sources/java/org/apache/tez/dag/api/records/DAGProtos.java>:[1652,30]
cannot find symbol
[ERROR] symbol  : class Parser
[ERROR] location: package com.google.protobuf
[ERROR] <https://builds.apache.org/job/Tez-Build/ws/tez-dag-api/target/generated-sources/java/org/apache/tez/dag/api/records/DAGProtos.java>:[2878,37]
cannot find symbol
[ERROR] symbol  : class Parser
[ERROR] location: package com.google.protobuf
[ERROR] <https://builds.apache.org/job/Tez-Build/ws/tez-dag-api/target/generated-sources/java/org/apache/tez/dag/api/records/DAGProtos.java>:[2889,30]
cannot find symbol
[ERROR] symbol  : class Parser
[ERROR] location: package com.google.protobuf
[ERROR] <https://builds.apache.org/job/Tez-Build/ws/tez-dag-api/target/generated-sources/java/org/apache/tez/dag/api/records/DAGProtos.java>:[3702,37]
cannot find symbol
[ERROR] symbol  : class Parser
[ERROR] location: package com.google.protobuf
[ERROR] <https://builds.apache.org/job/Tez-Build/ws/tez-dag-api/target/generated-sources/java/org/apache/tez/dag/api/records/DAGProtos.java>:[3713,30]
cannot find symbol
[ERROR] symbol  : class Parser
[ERROR] location: package com.google.protobuf
[ERROR] <https://builds.apache.org/job/Tez-Build/ws/tez-dag-api/target/generated-sources/java/org/apache/tez/dag/api/records/DAGProtos.java>:[5324,37]
cannot find symbol
[ERROR] symbol  : class Parser
[ERROR] location: package com.google.protobuf
[ERROR] <https://builds.apache.org/job/Tez-Build/ws/tez-dag-api/target/generated-sources/java/org/apache/tez/dag/api/records/DAGProtos.java>:[5335,30]
cannot find symbol
[ERROR] symbol  : class Parser
[ERROR] location: package com.google.protobuf
[ERROR] <https://builds.apache.org/job/Tez-Build/ws/tez-dag-api/target/generated-sources/java/org/apache/tez/dag/api/records/DAGProtos.java>:[6084,37]
cannot find symbol
[ERROR] symbol  : class Parser
[ERROR] location: package com.google.protobuf
[ERROR] <https://builds.apache.org/job/Tez-Build/ws/tez-dag-api/target/generated-sources/java/org/apache/tez/dag/api/records/DAGProtos.java>:[6095,30]
cannot find symbol
[ERROR] symbol  : class Parser
[ERROR] location: package com.google.protobuf
[ERROR] <https://builds.apache.org/job/Tez-Build/ws/tez-dag-api/target/generated-sources/java/org/apache/tez/dag/api/records/DAGProtos.java>:[7839,37]
cannot find symbol
[ERROR] symbol  : class Parser
[ERROR] location: package com.google.protobuf
[ERROR] <https://builds.apache.org/job/Tez-Build/ws/tez-dag-api/target/generated-sources/java/org/apache/tez/dag/api/records/DAGProtos.java>:[7850,30]
cannot find symbol
[ERROR] symbol  : class Parser
[ERROR] location: package com.google.protobuf
[ERROR] <https://builds.apache.org/job/Tez-Build/ws/tez-dag-api/target/generated-sources/java/org/apache/tez/dag/api/records/DAGProtos.java>:[9198,37]
cannot find symbol
[ERROR] symbol  : class Parser
[ERROR] location: package com.google.protobuf
[ERROR] <https://builds.apache.org/job/Tez-Build/ws/tez-dag-api/target/generated-sources/java/org/apache/tez/dag/api/records/DAGProtos.java>:[9209,30]
cannot find symbol
[ERROR] symbol  : class Parser
[ERROR] location: package com.google.protobuf
[ERROR] <https://builds.apache.org/job/Tez-Build/ws/tez-dag-api/target/generated-sources/java/org/apache/tez/dag/api/records/DAGProtos.java>:[10002,37]
cannot find symbol
[ERROR] symbol  : class Parser
[ERROR] location: package com.google.protobuf
[ERROR] <https://builds.apache.org/job/Tez-Build/ws/tez-dag-api/target/generated-sources/java/org/apache/tez/dag/api/records/DAGProtos.java>:[10013,30]
cannot find symbol
[ERROR] symbol  : class Parser
[ERROR] location: package com.google.protobuf
[ERROR] <https://builds.apache.org/job/Tez-Build/ws/tez-dag-api/target/generated-sources/java/org/apache/tez/dag/api/client/rpc/DAGClientAMProtocolRPC.java>:[39,8]
getUnknownFields() in org.apache.tez.dag.api.client.rpc.DAGClientAMProtocolRPC.GetAllDAGsRequestProto
cannot override getUnknownFields() in com.google.protobuf.GeneratedMessage; overridden method
is final
[ERROR] <https://builds.apache.org/job/Tez-Build/ws/tez-dag-api/target/generated-sources/java/org/apache/tez/dag/api/client/rpc/DAGClientAMProtocolRPC.java>:[58,19]
cannot find symbol
[ERROR] symbol  : method parseUnknownField(com.google.protobuf.CodedInputStream,com.google.protobuf.UnknownFieldSet.Builder,com.google.protobuf.ExtensionRegistryLite,int)
[ERROR] location: class org.apache.tez.dag.api.client.rpc.DAGClientAMProtocolRPC.GetAllDAGsRequestProto
[ERROR] <https://builds.apache.org/job/Tez-Build/ws/tez-dag-api/target/generated-sources/java/org/apache/tez/dag/api/client/rpc/DAGClientAMProtocolRPC.java>:[67,15]
cannot find symbol
[ERROR] symbol  : method setUnfinishedMessage(org.apache.tez.dag.api.client.rpc.DAGClientAMProtocolRPC.GetAllDAGsRequestProto)
[ERROR] location: class com.google.protobuf.InvalidProtocolBufferException
[ERROR] <https://builds.apache.org/job/Tez-Build/ws/tez-dag-api/target/generated-sources/java/org/apache/tez/dag/api/client/rpc/DAGClientAMProtocolRPC.java>:[70,27]
cannot find symbol
[ERROR] symbol  : method setUnfinishedMessage(org.apache.tez.dag.api.client.rpc.DAGClientAMProtocolRPC.GetAllDAGsRequestProto)
[ERROR] location: class com.google.protobuf.InvalidProtocolBufferException
[ERROR] <https://builds.apache.org/job/Tez-Build/ws/tez-dag-api/target/generated-sources/java/org/apache/tez/dag/api/client/rpc/DAGClientAMProtocolRPC.java>:[73,8]
cannot find symbol
[ERROR] symbol  : method makeExtensionsImmutable()
[ERROR] location: class org.apache.tez.dag.api.client.rpc.DAGClientAMProtocolRPC.GetAllDAGsRequestProto
[ERROR] <https://builds.apache.org/job/Tez-Build/ws/tez-dag-api/target/generated-sources/java/org/apache/tez/dag/api/client/rpc/DAGClientAMProtocolRPC.java>:[84,10]
cannot find symbol
[ERROR] symbol  : method ensureFieldAccessorsInitialized(java.lang.Class<org.apache.tez.dag.api.client.rpc.DAGClientAMProtocolRPC.GetAllDAGsRequestProto>,java.lang.Class<org.apache.tez.dag.api.client.rpc.DAGClientAMProtocolRPC.GetAllDAGsRequestProto.Builder>)
[ERROR] location: class com.google.protobuf.GeneratedMessage.FieldAccessorTable
[ERROR] <https://builds.apache.org/job/Tez-Build/ws/tez-dag-api/target/generated-sources/java/org/apache/tez/dag/api/client/rpc/DAGClientAMProtocolRPC.java>:[89,31]
cannot find symbol
[ERROR] symbol  : class AbstractParser
[ERROR] location: package com.google.protobuf
[ERROR] <https://builds.apache.org/job/Tez-Build/ws/tez-dag-api/target/generated-sources/java/org/apache/tez/dag/api/client/rpc/DAGClientAMProtocolRPC.java>:[98,4]
method does not override or implement a method from a supertype
[ERROR] <https://builds.apache.org/job/Tez-Build/ws/tez-dag-api/target/generated-sources/java/org/apache/tez/dag/api/client/rpc/DAGClientAMProtocolRPC.java>:[247,12]
cannot find symbol
[ERROR] symbol  : method ensureFieldAccessorsInitialized(java.lang.Class<org.apache.tez.dag.api.client.rpc.DAGClientAMProtocolRPC.GetAllDAGsRequestProto>,java.lang.Class<org.apache.tez.dag.api.client.rpc.DAGClientAMProtocolRPC.GetAllDAGsRequestProto.Builder>)
[ERROR] location: class com.google.protobuf.GeneratedMessage.FieldAccessorTable
[ERROR] <https://builds.apache.org/job/Tez-Build/ws/tez-dag-api/target/generated-sources/java/org/apache/tez/dag/api/client/rpc/DAGClientAMProtocolRPC.java>:[328,109]
cannot find symbol
[ERROR] symbol  : method getUnfinishedMessage()
[ERROR] location: class com.google.protobuf.InvalidProtocolBufferException
[ERROR] <https://builds.apache.org/job/Tez-Build/ws/tez-dag-api/target/generated-sources/java/org/apache/tez/dag/api/client/rpc/DAGClientAMProtocolRPC.java>:[397,8]
getUnknownFields() in org.apache.tez.dag.api.client.rpc.DAGClientAMProtocolRPC.GetAllDAGsResponseProto
cannot override getUnknownFields() in com.google.protobuf.GeneratedMessage; overridden method
is final
[ERROR] <https://builds.apache.org/job/Tez-Build/ws/tez-dag-api/target/generated-sources/java/org/apache/tez/dag/api/client/rpc/DAGClientAMProtocolRPC.java>:[417,19]
cannot find symbol
[ERROR] symbol  : method parseUnknownField(com.google.protobuf.CodedInputStream,com.google.protobuf.UnknownFieldSet.Builder,com.google.protobuf.ExtensionRegistryLite,int)
[ERROR] location: class org.apache.tez.dag.api.client.rpc.DAGClientAMProtocolRPC.GetAllDAGsResponseProto
[ERROR] <https://builds.apache.org/job/Tez-Build/ws/tez-dag-api/target/generated-sources/java/org/apache/tez/dag/api/client/rpc/DAGClientAMProtocolRPC.java>:[434,15]
cannot find symbol
[ERROR] symbol  : method setUnfinishedMessage(org.apache.tez.dag.api.client.rpc.DAGClientAMProtocolRPC.GetAllDAGsResponseProto)
[ERROR] location: class com.google.protobuf.InvalidProtocolBufferException
[ERROR] <https://builds.apache.org/job/Tez-Build/ws/tez-dag-api/target/generated-sources/java/org/apache/tez/dag/api/client/rpc/DAGClientAMProtocolRPC.java>:[437,27]
cannot find symbol
[ERROR] symbol  : method setUnfinishedMessage(org.apache.tez.dag.api.client.rpc.DAGClientAMProtocolRPC.GetAllDAGsResponseProto)
[ERROR] location: class com.google.protobuf.InvalidProtocolBufferException
[ERROR] <https://builds.apache.org/job/Tez-Build/ws/tez-dag-api/target/generated-sources/java/org/apache/tez/dag/api/client/rpc/DAGClientAMProtocolRPC.java>:[443,8]
cannot find symbol
[ERROR] symbol  : method makeExtensionsImmutable()
[ERROR] location: class org.apache.tez.dag.api.client.rpc.DAGClientAMProtocolRPC.GetAllDAGsResponseProto
[ERROR] <https://builds.apache.org/job/Tez-Build/ws/tez-dag-api/target/generated-sources/java/org/apache/tez/dag/api/client/rpc/DAGClientAMProtocolRPC.java>:[454,10]
cannot find symbol
[ERROR] symbol  : method ensureFieldAccessorsInitialized(java.lang.Class<org.apache.tez.dag.api.client.rpc.DAGClientAMProtocolRPC.GetAllDAGsResponseProto>,java.lang.Class<org.apache.tez.dag.api.client.rpc.DAGClientAMProtocolRPC.GetAllDAGsResponseProto.Builder>)
[ERROR] location: class com.google.protobuf.GeneratedMessage.FieldAccessorTable
[ERROR] <https://builds.apache.org/job/Tez-Build/ws/tez-dag-api/target/generated-sources/java/org/apache/tez/dag/api/client/rpc/DAGClientAMProtocolRPC.java>:[459,31]
cannot find symbol
[ERROR] symbol  : class AbstractParser
[ERROR] location: package com.google.protobuf
[ERROR] <https://builds.apache.org/job/Tez-Build/ws/tez-dag-api/target/generated-sources/java/org/apache/tez/dag/api/client/rpc/DAGClientAMProtocolRPC.java>:[468,4]
method does not override or implement a method from a supertype
[ERROR] <https://builds.apache.org/job/Tez-Build/ws/tez-dag-api/target/generated-sources/java/org/apache/tez/dag/api/client/rpc/DAGClientAMProtocolRPC.java>:[666,12]
cannot find symbol
[ERROR] symbol  : method ensureFieldAccessorsInitialized(java.lang.Class<org.apache.tez.dag.api.client.rpc.DAGClientAMProtocolRPC.GetAllDAGsResponseProto>,java.lang.Class<org.apache.tez.dag.api.client.rpc.DAGClientAMProtocolRPC.GetAllDAGsResponseProto.Builder>)
[ERROR] location: class com.google.protobuf.GeneratedMessage.FieldAccessorTable
[ERROR] <https://builds.apache.org/job/Tez-Build/ws/tez-dag-api/target/generated-sources/java/org/apache/tez/dag/api/client/rpc/DAGClientAMProtocolRPC.java>:[766,110]
cannot find symbol
[ERROR] symbol  : method getUnfinishedMessage()
[ERROR] location: class com.google.protobuf.InvalidProtocolBufferException
[ERROR] <https://builds.apache.org/job/Tez-Build/ws/tez-dag-api/target/generated-sources/java/org/apache/tez/dag/api/client/rpc/DAGClientAMProtocolRPC.java>:[924,8]
getUnknownFields() in org.apache.tez.dag.api.client.rpc.DAGClientAMProtocolRPC.GetDAGStatusRequestProto
cannot override getUnknownFields() in com.google.protobuf.GeneratedMessage; overridden method
is final
[ERROR] <https://builds.apache.org/job/Tez-Build/ws/tez-dag-api/target/generated-sources/java/org/apache/tez/dag/api/client/rpc/DAGClientAMProtocolRPC.java>:[944,19]
cannot find symbol
[ERROR] symbol  : method parseUnknownField(com.google.protobuf.CodedInputStream,com.google.protobuf.UnknownFieldSet.Builder,com.google.protobuf.ExtensionRegistryLite,int)
[ERROR] location: class org.apache.tez.dag.api.client.rpc.DAGClientAMProtocolRPC.GetDAGStatusRequestProto
[ERROR] <https://builds.apache.org/job/Tez-Build/ws/tez-dag-api/target/generated-sources/java/org/apache/tez/dag/api/client/rpc/DAGClientAMProtocolRPC.java>:[958,15]
cannot find symbol
[ERROR] symbol  : method setUnfinishedMessage(org.apache.tez.dag.api.client.rpc.DAGClientAMProtocolRPC.GetDAGStatusRequestProto)
[ERROR] location: class com.google.protobuf.InvalidProtocolBufferException
[ERROR] <https://builds.apache.org/job/Tez-Build/ws/tez-dag-api/target/generated-sources/java/org/apache/tez/dag/api/client/rpc/DAGClientAMProtocolRPC.java>:[961,27]
cannot find symbol
[ERROR] symbol  : method setUnfinishedMessage(org.apache.tez.dag.api.client.rpc.DAGClientAMProtocolRPC.GetDAGStatusRequestProto)
[ERROR] location: class com.google.protobuf.InvalidProtocolBufferException
[ERROR] <https://builds.apache.org/job/Tez-Build/ws/tez-dag-api/target/generated-sources/java/org/apache/tez/dag/api/client/rpc/DAGClientAMProtocolRPC.java>:[964,8]
cannot find symbol
[ERROR] symbol  : method makeExtensionsImmutable()
[ERROR] location: class org.apache.tez.dag.api.client.rpc.DAGClientAMProtocolRPC.GetDAGStatusRequestProto
[ERROR] <https://builds.apache.org/job/Tez-Build/ws/tez-dag-api/target/generated-sources/java/org/apache/tez/dag/api/client/rpc/DAGClientAMProtocolRPC.java>:[975,10]
cannot find symbol
[ERROR] symbol  : method ensureFieldAccessorsInitialized(java.lang.Class<org.apache.tez.dag.api.client.rpc.DAGClientAMProtocolRPC.GetDAGStatusRequestProto>,java.lang.Class<org.apache.tez.dag.api.client.rpc.DAGClientAMProtocolRPC.GetDAGStatusRequestProto.Builder>)
[ERROR] location: class com.google.protobuf.GeneratedMessage.FieldAccessorTable
[ERROR] <https://builds.apache.org/job/Tez-Build/ws/tez-dag-api/target/generated-sources/java/org/apache/tez/dag/api/client/rpc/DAGClientAMProtocolRPC.java>:[980,31]
cannot find symbol
[ERROR] symbol  : class AbstractParser
[ERROR] location: package com.google.protobuf
[ERROR] <https://builds.apache.org/job/Tez-Build/ws/tez-dag-api/target/generated-sources/java/org/apache/tez/dag/api/client/rpc/DAGClientAMProtocolRPC.java>:[989,4]
method does not override or implement a method from a supertype
[ERROR] <https://builds.apache.org/job/Tez-Build/ws/tez-dag-api/target/generated-sources/java/org/apache/tez/dag/api/client/rpc/DAGClientAMProtocolRPC.java>:[1015,14]
cannot find symbol
[ERROR] symbol  : method isValidUtf8()
[ERROR] location: class com.google.protobuf.ByteString
[ERROR] <https://builds.apache.org/job/Tez-Build/ws/tez-dag-api/target/generated-sources/java/org/apache/tez/dag/api/client/rpc/DAGClientAMProtocolRPC.java>:[1199,12]
cannot find symbol
[ERROR] symbol  : method ensureFieldAccessorsInitialized(java.lang.Class<org.apache.tez.dag.api.client.rpc.DAGClientAMProtocolRPC.GetDAGStatusRequestProto>,java.lang.Class<org.apache.tez.dag.api.client.rpc.DAGClientAMProtocolRPC.GetDAGStatusRequestProto.Builder>)
[ERROR] location: class com.google.protobuf.GeneratedMessage.FieldAccessorTable
[ERROR] <https://builds.apache.org/job/Tez-Build/ws/tez-dag-api/target/generated-sources/java/org/apache/tez/dag/api/client/rpc/DAGClientAMProtocolRPC.java>:[1294,111]
cannot find symbol
[ERROR] symbol  : method getUnfinishedMessage()
[ERROR] location: class com.google.protobuf.InvalidProtocolBufferException
[ERROR] <https://builds.apache.org/job/Tez-Build/ws/tez-dag-api/target/generated-sources/java/org/apache/tez/dag/api/client/rpc/DAGClientAMProtocolRPC.java>:[1432,8]
getUnknownFields() in org.apache.tez.dag.api.client.rpc.DAGClientAMProtocolRPC.GetDAGStatusResponseProto
cannot override getUnknownFields() in com.google.protobuf.GeneratedMessage; overridden method
is final
[ERROR] <https://builds.apache.org/job/Tez-Build/ws/tez-dag-api/target/generated-sources/java/org/apache/tez/dag/api/client/rpc/DAGClientAMProtocolRPC.java>:[1452,19]
cannot find symbol
[ERROR] symbol  : method parseUnknownField(com.google.protobuf.CodedInputStream,com.google.protobuf.UnknownFieldSet.Builder,com.google.protobuf.ExtensionRegistryLite,int)
[ERROR] location: class org.apache.tez.dag.api.client.rpc.DAGClientAMProtocolRPC.GetDAGStatusResponseProto
[ERROR] <https://builds.apache.org/job/Tez-Build/ws/tez-dag-api/target/generated-sources/java/org/apache/tez/dag/api/client/rpc/DAGClientAMProtocolRPC.java>:[1474,15]
cannot find symbol
[ERROR] symbol  : method setUnfinishedMessage(org.apache.tez.dag.api.client.rpc.DAGClientAMProtocolRPC.GetDAGStatusResponseProto)
[ERROR] location: class com.google.protobuf.InvalidProtocolBufferException
[ERROR] <https://builds.apache.org/job/Tez-Build/ws/tez-dag-api/target/generated-sources/java/org/apache/tez/dag/api/client/rpc/DAGClientAMProtocolRPC.java>:[1477,27]
cannot find symbol
[ERROR] symbol  : method setUnfinishedMessage(org.apache.tez.dag.api.client.rpc.DAGClientAMProtocolRPC.GetDAGStatusResponseProto)
[ERROR] location: class com.google.protobuf.InvalidProtocolBufferException
[ERROR] <https://builds.apache.org/job/Tez-Build/ws/tez-dag-api/target/generated-sources/java/org/apache/tez/dag/api/client/rpc/DAGClientAMProtocolRPC.java>:[1480,8]
cannot find symbol
[ERROR] symbol  : method makeExtensionsImmutable()
[ERROR] location: class org.apache.tez.dag.api.client.rpc.DAGClientAMProtocolRPC.GetDAGStatusResponseProto
[ERROR] <https://builds.apache.org/job/Tez-Build/ws/tez-dag-api/target/generated-sources/java/org/apache/tez/dag/api/client/rpc/DAGClientAMProtocolRPC.java>:[1491,10]
cannot find symbol
[ERROR] symbol  : method ensureFieldAccessorsInitialized(java.lang.Class<org.apache.tez.dag.api.client.rpc.DAGClientAMProtocolRPC.GetDAGStatusResponseProto>,java.lang.Class<org.apache.tez.dag.api.client.rpc.DAGClientAMProtocolRPC.GetDAGStatusResponseProto.Builder>)
[ERROR] location: class com.google.protobuf.GeneratedMessage.FieldAccessorTable
[ERROR] <https://builds.apache.org/job/Tez-Build/ws/tez-dag-api/target/generated-sources/java/org/apache/tez/dag/api/client/rpc/DAGClientAMProtocolRPC.java>:[1496,31]
cannot find symbol
[ERROR] symbol  : class AbstractParser
[ERROR] location: package com.google.protobuf
[ERROR] <https://builds.apache.org/job/Tez-Build/ws/tez-dag-api/target/generated-sources/java/org/apache/tez/dag/api/client/rpc/DAGClientAMProtocolRPC.java>:[1505,4]
method does not override or implement a method from a supertype
[ERROR] <https://builds.apache.org/job/Tez-Build/ws/tez-dag-api/target/generated-sources/java/org/apache/tez/dag/api/client/rpc/DAGClientAMProtocolRPC.java>:[1700,12]
cannot find symbol
[ERROR] symbol  : method ensureFieldAccessorsInitialized(java.lang.Class<org.apache.tez.dag.api.client.rpc.DAGClientAMProtocolRPC.GetDAGStatusResponseProto>,java.lang.Class<org.apache.tez.dag.api.client.rpc.DAGClientAMProtocolRPC.GetDAGStatusResponseProto.Builder>)
[ERROR] location: class com.google.protobuf.GeneratedMessage.FieldAccessorTable
[ERROR] <https://builds.apache.org/job/Tez-Build/ws/tez-dag-api/target/generated-sources/java/org/apache/tez/dag/api/client/rpc/DAGClientAMProtocolRPC.java>:[1808,112]
cannot find symbol
[ERROR] symbol  : method getUnfinishedMessage()
[ERROR] location: class com.google.protobuf.InvalidProtocolBufferException
[ERROR] <https://builds.apache.org/job/Tez-Build/ws/tez-dag-api/target/generated-sources/java/org/apache/tez/dag/api/client/rpc/DAGClientAMProtocolRPC.java>:[2005,8]
getUnknownFields() in org.apache.tez.dag.api.client.rpc.DAGClientAMProtocolRPC.GetVertexStatusRequestProto
cannot override getUnknownFields() in com.google.protobuf.GeneratedMessage; overridden method
is final
[ERROR] <https://builds.apache.org/job/Tez-Build/ws/tez-dag-api/target/generated-sources/java/org/apache/tez/dag/api/client/rpc/DAGClientAMProtocolRPC.java>:[2025,19]
cannot find symbol
[ERROR] symbol  : method parseUnknownField(com.google.protobuf.CodedInputStream,com.google.protobuf.UnknownFieldSet.Builder,com.google.protobuf.ExtensionRegistryLite,int)
[ERROR] location: class org.apache.tez.dag.api.client.rpc.DAGClientAMProtocolRPC.GetVertexStatusRequestProto
[ERROR] <https://builds.apache.org/job/Tez-Build/ws/tez-dag-api/target/generated-sources/java/org/apache/tez/dag/api/client/rpc/DAGClientAMProtocolRPC.java>:[2044,15]
cannot find symbol
[ERROR] symbol  : method setUnfinishedMessage(org.apache.tez.dag.api.client.rpc.DAGClientAMProtocolRPC.GetVertexStatusRequestProto)
[ERROR] location: class com.google.protobuf.InvalidProtocolBufferException
[ERROR] <https://builds.apache.org/job/Tez-Build/ws/tez-dag-api/target/generated-sources/java/org/apache/tez/dag/api/client/rpc/DAGClientAMProtocolRPC.java>:[2047,27]
cannot find symbol
[ERROR] symbol  : method setUnfinishedMessage(org.apache.tez.dag.api.client.rpc.DAGClientAMProtocolRPC.GetVertexStatusRequestProto)
[ERROR] location: class com.google.protobuf.InvalidProtocolBufferException
[ERROR] <https://builds.apache.org/job/Tez-Build/ws/tez-dag-api/target/generated-sources/java/org/apache/tez/dag/api/client/rpc/DAGClientAMProtocolRPC.java>:[2050,8]
cannot find symbol
[ERROR] symbol  : method makeExtensionsImmutable()
[ERROR] location: class org.apache.tez.dag.api.client.rpc.DAGClientAMProtocolRPC.GetVertexStatusRequestProto
[ERROR] <https://builds.apache.org/job/Tez-Build/ws/tez-dag-api/target/generated-sources/java/org/apache/tez/dag/api/client/rpc/DAGClientAMProtocolRPC.java>:[2061,10]
cannot find symbol
[ERROR] symbol  : method ensureFieldAccessorsInitialized(java.lang.Class<org.apache.tez.dag.api.client.rpc.DAGClientAMProtocolRPC.GetVertexStatusRequestProto>,java.lang.Class<org.apache.tez.dag.api.client.rpc.DAGClientAMProtocolRPC.GetVertexStatusRequestProto.Builder>)
[ERROR] location: class com.google.protobuf.GeneratedMessage.FieldAccessorTable
[ERROR] <https://builds.apache.org/job/Tez-Build/ws/tez-dag-api/target/generated-sources/java/org/apache/tez/dag/api/client/rpc/DAGClientAMProtocolRPC.java>:[2066,31]
cannot find symbol
[ERROR] symbol  : class AbstractParser
[ERROR] location: package com.google.protobuf
[ERROR] <https://builds.apache.org/job/Tez-Build/ws/tez-dag-api/target/generated-sources/java/org/apache/tez/dag/api/client/rpc/DAGClientAMProtocolRPC.java>:[2075,4]
method does not override or implement a method from a supertype
[ERROR] <https://builds.apache.org/job/Tez-Build/ws/tez-dag-api/target/generated-sources/java/org/apache/tez/dag/api/client/rpc/DAGClientAMProtocolRPC.java>:[2101,14]
cannot find symbol
[ERROR] symbol  : method isValidUtf8()
[ERROR] location: class com.google.protobuf.ByteString
[ERROR] <https://builds.apache.org/job/Tez-Build/ws/tez-dag-api/target/generated-sources/java/org/apache/tez/dag/api/client/rpc/DAGClientAMProtocolRPC.java>:[2144,14]
cannot find symbol
[ERROR] symbol  : method isValidUtf8()
[ERROR] location: class com.google.protobuf.ByteString
[ERROR] <https://builds.apache.org/job/Tez-Build/ws/tez-dag-api/target/generated-sources/java/org/apache/tez/dag/api/client/rpc/DAGClientAMProtocolRPC.java>:[2345,12]
cannot find symbol
[ERROR] symbol  : method ensureFieldAccessorsInitialized(java.lang.Class<org.apache.tez.dag.api.client.rpc.DAGClientAMProtocolRPC.GetVertexStatusRequestProto>,java.lang.Class<org.apache.tez.dag.api.client.rpc.DAGClientAMProtocolRPC.GetVertexStatusRequestProto.Builder>)
[ERROR] location: class com.google.protobuf.GeneratedMessage.FieldAccessorTable
[ERROR] <https://builds.apache.org/job/Tez-Build/ws/tez-dag-api/target/generated-sources/java/org/apache/tez/dag/api/client/rpc/DAGClientAMProtocolRPC.java>:[2451,114]
cannot find symbol
[ERROR] symbol  : method getUnfinishedMessage()
[ERROR] location: class com.google.protobuf.InvalidProtocolBufferException
[ERROR] <https://builds.apache.org/job/Tez-Build/ws/tez-dag-api/target/generated-sources/java/org/apache/tez/dag/api/client/rpc/DAGClientAMProtocolRPC.java>:[2663,8]
getUnknownFields() in org.apache.tez.dag.api.client.rpc.DAGClientAMProtocolRPC.GetVertexStatusResponseProto
cannot override getUnknownFields() in com.google.protobuf.GeneratedMessage; overridden method
is final
[ERROR] <https://builds.apache.org/job/Tez-Build/ws/tez-dag-api/target/generated-sources/java/org/apache/tez/dag/api/client/rpc/DAGClientAMProtocolRPC.java>:[2683,19]
cannot find symbol
[ERROR] symbol  : method parseUnknownField(com.google.protobuf.CodedInputStream,com.google.protobuf.UnknownFieldSet.Builder,com.google.protobuf.ExtensionRegistryLite,int)
[ERROR] location: class org.apache.tez.dag.api.client.rpc.DAGClientAMProtocolRPC.GetVertexStatusResponseProto
[ERROR] <https://builds.apache.org/job/Tez-Build/ws/tez-dag-api/target/generated-sources/java/org/apache/tez/dag/api/client/rpc/DAGClientAMProtocolRPC.java>:[2705,15]
cannot find symbol
[ERROR] symbol  : method setUnfinishedMessage(org.apache.tez.dag.api.client.rpc.DAGClientAMProtocolRPC.GetVertexStatusResponseProto)
[ERROR] location: class com.google.protobuf.InvalidProtocolBufferException
[ERROR] <https://builds.apache.org/job/Tez-Build/ws/tez-dag-api/target/generated-sources/java/org/apache/tez/dag/api/client/rpc/DAGClientAMProtocolRPC.java>:[2708,27]
cannot find symbol
[ERROR] symbol  : method setUnfinishedMessage(org.apache.tez.dag.api.client.rpc.DAGClientAMProtocolRPC.GetVertexStatusResponseProto)
[ERROR] location: class com.google.protobuf.InvalidProtocolBufferException
[ERROR] <https://builds.apache.org/job/Tez-Build/ws/tez-dag-api/target/generated-sources/java/org/apache/tez/dag/api/client/rpc/DAGClientAMProtocolRPC.java>:[2711,8]
cannot find symbol
[ERROR] symbol  : method makeExtensionsImmutable()
[ERROR] location: class org.apache.tez.dag.api.client.rpc.DAGClientAMProtocolRPC.GetVertexStatusResponseProto
[ERROR] -> [Help 1]
[ERROR] 
[ERROR] To see the full stack trace of the errors, re-run Maven with the -e switch.
[ERROR] Re-run Maven using the -X switch to enable full debug logging.
[ERROR] 
[ERROR] For more information about the errors and possible solutions, please read the following
articles:
[ERROR] [Help 1] http://cwiki.apache.org/confluence/display/MAVEN/MojoFailureException
[ERROR] 
[ERROR] After correcting the problems, you can resume the build with the command
[ERROR]   mvn <goals> -rf :tez-dag-api
Build step 'Execute shell' marked build as failure
Archiving artifacts
Recording test results

Mime
View raw message