tez-dev mailing list archives

Site index · List index
Message view « Date » · « Thread »
Top « Date » · « Thread »
From Apache Jenkins Server <jenk...@builds.apache.org>
Subject Build failed in Jenkins: Tez-Build #101
Date Fri, 16 Aug 2013 17:55:20 GMT
See <https://builds.apache.org/job/Tez-Build/101/changes>

Changes:

[sseth] Log different messages for valid containers which are being told to die

------------------------------------------
[...truncated 1790 lines...]
148 KB   7 KB   14 KB   
4 KB   148 KB   7 KB   14 KB   
8 KB   148 KB   7 KB   14 KB   
12 KB   148 KB   7 KB   14 KB   
14 KB   148 KB   7 KB   14 KB   
18 KB   148 KB   7 KB   14 KB   
20 KB   148 KB   7 KB   14 KB   
20 KB   148 KB   11 KB   14 KB   
20 KB   148 KB   15 KB   14 KB   
20 KB   148 KB   19 KB   14 KB   
20 KB   148 KB   21 KB   14 KB   
20 KB   148 KB   23 KB   14 KB   
20 KB   148 KB   27 KB   14 KB   
20 KB   148 KB   31 KB   14 KB   
20 KB   148 KB   35 KB   14 KB   
20 KB   148 KB   37 KB   14 KB   
20 KB   152 KB   37 KB   14 KB   
20 KB   156 KB   37 KB   14 KB   
20 KB   160 KB   37 KB   14 KB   
20 KB   164 KB   37 KB   14 KB   
20 KB   168 KB   37 KB   14 KB   
20 KB   172 KB   37 KB   14 KB   
20 KB   176 KB   37 KB   14 KB   
20 KB   180 KB   37 KB   14 KB   
20 KB   181 KB   37 KB   14 KB   
20 KB   181 KB   37 KB   18 KB   
20 KB   181 KB   37 KB   22 KB   
20 KB   181 KB   37 KB   26 KB   
20 KB   181 KB   37 KB   30 KB   
24 KB   181 KB   37 KB   30 KB   
28 KB   181 KB   37 KB   30 KB   
30 KB   181 KB   37 KB   30 KB   
34 KB   181 KB   37 KB   30 KB   
38 KB   181 KB   37 KB   30 KB   
39 KB   181 KB   37 KB   30 KB   
43 KB   181 KB   37 KB   30 KB   
43 KB   181 KB   41 KB   30 KB   
43 KB   181 KB   45 KB   30 KB   
43 KB   181 KB   49 KB   30 KB   
43 KB   181 KB   53 KB   30 KB   
43 KB   181 KB   57 KB   30 KB   
43 KB   181 KB   61 KB   30 KB   
43 KB   181 KB   65 KB   30 KB   
43 KB   181 KB   69 KB   30 KB   
43 KB   181 KB   69 KB   34 KB   
43 KB   181 KB   69 KB   38 KB   
43 KB   181 KB   69 KB   42 KB   
43 KB   181 KB   69 KB   46 KB   
43 KB   181 KB   69 KB   50 KB   
43 KB   181 KB   69 KB   54 KB   
43 KB   181 KB   69 KB   57 KB   
                                 
Downloaded: https://maven.atlassian.com/repository/public/org/codehaus/plexus/plexus-archiver/2.2/plexus-archiver-2.2.jar
(181 KB at 373.2 KB/sec)
43 KB   73 KB   57 KB            
43 KB   77 KB   57 KB   
43 KB   81 KB   57 KB   
43 KB   85 KB   57 KB   
43 KB   89 KB   57 KB   
43 KB   93 KB   57 KB   
43 KB   97 KB   57 KB   
43 KB   101 KB   57 KB   
                         
Downloaded: https://maven.atlassian.com/repository/public/org/apache/maven/shared/maven-filtering/1.1/maven-filtering-1.1.jar
(43 KB at 79.1 KB/sec)
105 KB   57 KB           
109 KB   57 KB   
113 KB   57 KB   
117 KB   57 KB   
121 KB   57 KB   
125 KB   57 KB   
129 KB   57 KB   
133 KB   57 KB   
137 KB   57 KB   
141 KB   57 KB   
145 KB   57 KB   
149 KB   57 KB   
                 
Downloaded: https://maven.atlassian.com/repository/public/org/codehaus/plexus/plexus-io/2.0.6/plexus-io-2.0.6.jar
(57 KB at 91.0 KB/sec)
153 KB           
157 KB   
161 KB   
165 KB   
169 KB   
173 KB   
177 KB   
181 KB   
185 KB   
189 KB   
193 KB   
197 KB   
201 KB   
205 KB   
209 KB   
213 KB   
217 KB   
221 KB   
225 KB   
227 KB   
         
Downloaded: https://maven.atlassian.com/repository/public/org/codehaus/plexus/plexus-utils/3.0.8/plexus-utils-3.0.8.jar
(227 KB at 280.9 KB/sec)
[INFO] Reading assembly descriptor: src/main/assembly/tez-dist-full.xml
Downloading: https://repository.apache.org/content/repositories/snapshots/org/tukaani/xz/1.0/xz-1.0.pom
         
Downloading: http://repo1.maven.org/maven2/org/tukaani/xz/1.0/xz-1.0.pom
         
Downloaded: http://repo1.maven.org/maven2/org/tukaani/xz/1.0/xz-1.0.pom (0 B at 0.0 KB/sec)
Downloading: https://repository.apache.org/content/repositories/snapshots/org/tukaani/xz/1.0/xz-1.0.jar
         
Downloading: http://repo1.maven.org/maven2/org/tukaani/xz/1.0/xz-1.0.jar
         
Downloaded: http://repo1.maven.org/maven2/org/tukaani/xz/1.0/xz-1.0.jar (0 B at 0.0 KB/sec)
[WARNING] NOTE: Currently, inclusion of module dependencies may produce unpredictable results
if a version conflict occurs.
Downloading: https://repository.apache.org/content/repositories/snapshots/com/google/inject/extensions/guice-servlet/3.0/guice-servlet-3.0.pom
         
Downloading: http://repo1.maven.org/maven2/com/google/inject/extensions/guice-servlet/3.0/guice-servlet-3.0.pom
         
Downloaded: http://repo1.maven.org/maven2/com/google/inject/extensions/guice-servlet/3.0/guice-servlet-3.0.pom
(0 B at 0.0 KB/sec)
Downloading: https://repository.apache.org/content/repositories/snapshots/com/google/inject/extensions/extensions-parent/3.0/extensions-parent-3.0.pom
         
Downloading: http://repo1.maven.org/maven2/com/google/inject/extensions/extensions-parent/3.0/extensions-parent-3.0.pom
         
Downloaded: http://repo1.maven.org/maven2/com/google/inject/extensions/extensions-parent/3.0/extensions-parent-3.0.pom
(0 B at 0.0 KB/sec)
Downloading: https://repository.apache.org/content/repositories/snapshots/com/google/inject/guice-parent/3.0/guice-parent-3.0.pom
         
Downloading: http://repo1.maven.org/maven2/com/google/inject/guice-parent/3.0/guice-parent-3.0.pom
         
Downloaded: http://repo1.maven.org/maven2/com/google/inject/guice-parent/3.0/guice-parent-3.0.pom
(0 B at 0.0 KB/sec)
Downloading: https://repository.apache.org/content/repositories/snapshots/com/google/inject/guice/3.0/guice-3.0.pom
         
Downloading: http://repo1.maven.org/maven2/com/google/inject/guice/3.0/guice-3.0.pom
         
Downloaded: http://repo1.maven.org/maven2/com/google/inject/guice/3.0/guice-3.0.pom (0 B at
0.0 KB/sec)
Downloading: https://repository.apache.org/content/repositories/snapshots/javax/xml/bind/jaxb-api/2.2.2/jaxb-api-2.2.2.pom
         
Downloading: http://repo1.maven.org/maven2/javax/xml/bind/jaxb-api/2.2.2/jaxb-api-2.2.2.pom
         
Downloaded: http://repo1.maven.org/maven2/javax/xml/bind/jaxb-api/2.2.2/jaxb-api-2.2.2.pom
(0 B at 0.0 KB/sec)
Downloading: https://repository.apache.org/content/repositories/snapshots/org/jboss/netty/netty/3.2.2.Final/netty-3.2.2.Final.pom
         
Downloading: http://repo1.maven.org/maven2/org/jboss/netty/netty/3.2.2.Final/netty-3.2.2.Final.pom
         
Downloaded: http://repo1.maven.org/maven2/org/jboss/netty/netty/3.2.2.Final/netty-3.2.2.Final.pom
(0 B at 0.0 KB/sec)
Downloading: https://repository.apache.org/content/repositories/snapshots/org/jboss/jboss-parent/5/jboss-parent-5.pom
         
Downloading: http://repo1.maven.org/maven2/org/jboss/jboss-parent/5/jboss-parent-5.pom
         
Downloaded: http://repo1.maven.org/maven2/org/jboss/jboss-parent/5/jboss-parent-5.pom (0 B
at 0.0 KB/sec)
Downloading: https://repository.apache.org/content/repositories/snapshots/com/google/guava/guava/11.0.2/guava-11.0.2.pom
         
Downloading: http://repo1.maven.org/maven2/com/google/guava/guava/11.0.2/guava-11.0.2.pom
         
Downloaded: http://repo1.maven.org/maven2/com/google/guava/guava/11.0.2/guava-11.0.2.pom (0
B at 0.0 KB/sec)
Downloading: https://repository.apache.org/content/repositories/snapshots/com/google/guava/guava-parent/11.0.2/guava-parent-11.0.2.pom
         
Downloading: http://repo1.maven.org/maven2/com/google/guava/guava-parent/11.0.2/guava-parent-11.0.2.pom
         
Downloaded: http://repo1.maven.org/maven2/com/google/guava/guava-parent/11.0.2/guava-parent-11.0.2.pom
(0 B at 0.0 KB/sec)
Downloading: https://repository.apache.org/content/repositories/snapshots/com/jcraft/jsch/0.1.42/jsch-0.1.42.pom
         
Downloading: http://repo1.maven.org/maven2/com/jcraft/jsch/0.1.42/jsch-0.1.42.pom
         
Downloaded: http://repo1.maven.org/maven2/com/jcraft/jsch/0.1.42/jsch-0.1.42.pom (0 B at 0.0
KB/sec)
[INFO] Building tar: <https://builds.apache.org/job/Tez-Build/101/artifact/tez-dist/target/tez-0.2.0-SNAPSHOT-full.tar.gz>
[INFO] 
[INFO] --- maven-assembly-plugin:2.4:single (package-tez) @ tez-dist ---
[INFO] Reading assembly descriptor: src/main/assembly/tez-dist.xml
[WARNING] NOTE: Currently, inclusion of module dependencies may produce unpredictable results
if a version conflict occurs.
[INFO] Building tar: <https://builds.apache.org/job/Tez-Build/101/artifact/tez-dist/target/tez-0.2.0-SNAPSHOT.tar.gz>
[INFO] 
[INFO] --- maven-install-plugin:2.3.1:install (default-install) @ tez-dist ---
[INFO] Installing <https://builds.apache.org/job/Tez-Build/ws/tez-dist/pom.xml> to /home/jenkins/.m2/repository/org/apache/tez/tez-dist/0.2.0-SNAPSHOT/tez-dist-0.2.0-SNAPSHOT.pom
[INFO] 
[INFO] --- maven-deploy-plugin:2.5:deploy (default-deploy) @ tez-dist ---
Downloading: https://repository.apache.org/content/repositories/snapshots/org/apache/tez/tez-dist/0.2.0-SNAPSHOT/maven-metadata.xml
601 B    
        
Downloaded: https://repository.apache.org/content/repositories/snapshots/org/apache/tez/tez-dist/0.2.0-SNAPSHOT/maven-metadata.xml
(601 B at 1.5 KB/sec)
Uploading: https://repository.apache.org/content/repositories/snapshots/org/apache/tez/tez-dist/0.2.0-SNAPSHOT/tez-dist-0.2.0-20130816.175509-14.pom
4 KB    
5 KB   
       
Uploaded: https://repository.apache.org/content/repositories/snapshots/org/apache/tez/tez-dist/0.2.0-SNAPSHOT/tez-dist-0.2.0-20130816.175509-14.pom
(5 KB at 17.8 KB/sec)
Downloading: https://repository.apache.org/content/repositories/snapshots/org/apache/tez/tez-dist/maven-metadata.xml
282 B   
        
Downloaded: https://repository.apache.org/content/repositories/snapshots/org/apache/tez/tez-dist/maven-metadata.xml
(282 B at 1.8 KB/sec)
Uploading: https://repository.apache.org/content/repositories/snapshots/org/apache/tez/tez-dist/0.2.0-SNAPSHOT/maven-metadata.xml
601 B   
        
Uploaded: https://repository.apache.org/content/repositories/snapshots/org/apache/tez/tez-dist/0.2.0-SNAPSHOT/maven-metadata.xml
(601 B at 2.9 KB/sec)
Uploading: https://repository.apache.org/content/repositories/snapshots/org/apache/tez/tez-dist/maven-metadata.xml
282 B   
        
Uploaded: https://repository.apache.org/content/repositories/snapshots/org/apache/tez/tez-dist/maven-metadata.xml
(282 B at 1.7 KB/sec)
[INFO] 
[INFO] --- maven-assembly-plugin:2.4:single (package-tez-full) @ tez-dist ---
[INFO] Reading assembly descriptor: src/main/assembly/tez-dist-full.xml
[WARNING] NOTE: Currently, inclusion of module dependencies may produce unpredictable results
if a version conflict occurs.
[INFO] Building tar: <https://builds.apache.org/job/Tez-Build/101/artifact/tez-dist/target/tez-0.2.0-SNAPSHOT-full.tar.gz>
[INFO] 
[INFO] --- maven-assembly-plugin:2.4:single (package-tez) @ tez-dist ---
[INFO] Reading assembly descriptor: src/main/assembly/tez-dist.xml
[WARNING] NOTE: Currently, inclusion of module dependencies may produce unpredictable results
if a version conflict occurs.
[INFO] Building tar: <https://builds.apache.org/job/Tez-Build/101/artifact/tez-dist/target/tez-0.2.0-SNAPSHOT.tar.gz>
[INFO]                                                                         
[INFO] ------------------------------------------------------------------------
[INFO] Building Tez 0.2.0-SNAPSHOT
[INFO] ------------------------------------------------------------------------
[INFO] 
[INFO] --- maven-clean-plugin:2.4.1:clean (default-clean) @ tez-docs ---
[INFO] 
[INFO] --- maven-install-plugin:2.3.1:install (default-install) @ tez-docs ---
[INFO] Installing <https://builds.apache.org/job/Tez-Build/ws/docs/pom.xml> to /home/jenkins/.m2/repository/org/apache/tez/tez-docs/0.2.0-SNAPSHOT/tez-docs-0.2.0-SNAPSHOT.pom
[INFO] 
[INFO] --- maven-deploy-plugin:2.5:deploy (default-deploy) @ tez-docs ---
[INFO] ------------------------------------------------------------------------
[INFO] Reactor Summary:
[INFO] 
[INFO] tez ............................................... SUCCESS [3.038s]
[INFO] tez-dag-api ....................................... SUCCESS [17.601s]
[INFO] tez-common ........................................ SUCCESS [4.513s]
[INFO] tez-engine-api .................................... SUCCESS [2.532s]
[INFO] tez-engine ........................................ SUCCESS [4.644s]
[INFO] tez-mapreduce ..................................... SUCCESS [17.350s]
[INFO] tez-yarn-client ................................... SUCCESS [2.812s]
[INFO] tez-dag ........................................... SUCCESS [23.281s]
[INFO] tez-mapreduce-examples ............................ SUCCESS [5.059s]
[INFO] tez-mapreduce-tests ............................... SUCCESS [2:50.687s]
[INFO] tez-dist .......................................... SUCCESS [14.952s]
[INFO] Tez ............................................... FAILURE [0.075s]
[INFO] ------------------------------------------------------------------------
[INFO] BUILD FAILURE
[INFO] ------------------------------------------------------------------------
[INFO] Total time: 4:26.879s
[INFO] Finished at: Fri Aug 16 17:55:13 UTC 2013
[INFO] Final Memory: 124M/783M
[INFO] ------------------------------------------------------------------------
[ERROR] Failed to execute goal org.apache.maven.plugins:maven-deploy-plugin:2.5:deploy (default-deploy)
on project tez-docs: Deployment failed: repository element was not specified in the POM inside
distributionManagement element or in -DaltDeploymentRepository=id::layout::url parameter ->
[Help 1]
[ERROR] 
[ERROR] To see the full stack trace of the errors, re-run Maven with the -e switch.
[ERROR] Re-run Maven using the -X switch to enable full debug logging.
[ERROR] 
[ERROR] For more information about the errors and possible solutions, please read the following
articles:
[ERROR] [Help 1] http://cwiki.apache.org/confluence/display/MAVEN/MojoExecutionException
[ERROR] 
[ERROR] After correcting the problems, you can resume the build with the command
[ERROR]   mvn <goals> -rf :tez-docs
Build step 'Execute shell' marked build as failure
Archiving artifacts
Recording test results

Mime
View raw message