tez-dev mailing list archives

Site index · List index
Message view « Date » · « Thread »
Top « Date » · « Thread »
From Apache Jenkins Server <jenk...@builds.apache.org>
Subject Build failed in Jenkins: Tez-Build #98
Date Tue, 13 Aug 2013 22:50:58 GMT
See <https://builds.apache.org/job/Tez-Build/98/changes>

Changes:

[sseth] TEZ-346. AM should not use TezConfiguration instances. Contributed by

------------------------------------------
[...truncated 925 lines...]
1827 KB   
1831 KB   
1835 KB   
1835 KB   
1839 KB   
1843 KB   
1847 KB   
1851 KB   
1855 KB   
1859 KB   
1863 KB   
1867 KB   
1871 KB   
1874 KB   
1878 KB   
1882 KB   
1886 KB   
1890 KB   
1894 KB   
1898 KB   
1902 KB   
1904 KB   
1908 KB   
1912 KB   
1916 KB   
1920 KB   
1924 KB   
1928 KB   
1932 KB   
1936 KB   
1940 KB   
1944 KB   
1948 KB   
1951 KB   
1955 KB   
1959 KB   
1963 KB   
1967 KB   
1971 KB   
1975 KB   
1979 KB   
1983 KB   
1987 KB   
1990 KB   
1994 KB   
1998 KB   
2002 KB   
2006 KB   
2010 KB   
2014 KB   
2018 KB   
2022 KB   
2026 KB   
2029 KB   
2033 KB   
2037 KB   
2041 KB   
2045 KB   
2049 KB   
2053 KB   
2057 KB   
2061 KB   
2065 KB   
2069 KB   
2073 KB   
2076 KB   
2080 KB   
2084 KB   
2088 KB   
2092 KB   
2096 KB   
2100 KB   
2104 KB   
2108 KB   
2112 KB   
2115 KB   
2119 KB   
2123 KB   
2127 KB   
2131 KB   
2135 KB   
2139 KB   
2143 KB   
2147 KB   
2151 KB   
2154 KB   
2158 KB   
2162 KB   
2166 KB   
2170 KB   
2174 KB   
2178 KB   
2182 KB   
2186 KB   
2190 KB   
2194 KB   
2196 KB   
2200 KB   
2204 KB   
2208 KB   
2212 KB   
2216 KB   
2220 KB   
2224 KB   
2228 KB   
2232 KB   
2236 KB   
2240 KB   
2243 KB   
2247 KB   
2251 KB   
2255 KB   
2259 KB   
2263 KB   
2267 KB   
2271 KB   
2275 KB   
2279 KB   
2282 KB   
2286 KB   
2290 KB   
2294 KB   
2298 KB   
2302 KB   
2306 KB   
2310 KB   
2314 KB   
2318 KB   
2321 KB   
2325 KB   
2329 KB   
2333 KB   
2337 KB   
2341 KB   
2345 KB   
2349 KB   
2353 KB   
2357 KB   
2361 KB   
2365 KB   
2368 KB   
2372 KB   
2376 KB   
2380 KB   
2384 KB   
2388 KB   
2392 KB   
2396 KB   
2400 KB   
2404 KB   
2407 KB   
2411 KB   
2415 KB   
2416 KB   
2420 KB   
2424 KB   
2428 KB   
2432 KB   
2436 KB   
2440 KB   
2444 KB   
2448 KB   
2452 KB   
2456 KB   
2460 KB   
2460 KB   
2464 KB   
2468 KB   
2472 KB   
2476 KB   
2480 KB   
2484 KB   
2488 KB   
2492 KB   
2496 KB   
2500 KB   
2504 KB   
2507 KB   
2511 KB   
2515 KB   
2519 KB   
2523 KB   
2527 KB   
2531 KB   
2535 KB   
2539 KB   
2543 KB   
2546 KB   
2550 KB   
2554 KB   
2558 KB   
2562 KB   
2566 KB   
2570 KB   
2574 KB   
2578 KB   
2582 KB   
2585 KB   
2589 KB   
2593 KB   
2597 KB   
2601 KB   
2605 KB   
2609 KB   
2613 KB   
2617 KB   
2621 KB   
2623 KB   
          
Downloaded: https://repository.apache.org/content/repositories/snapshots/org/apache/hadoop/hadoop-common/3.0.0-SNAPSHOT/hadoop-common-3.0.0-20130813.150417-3205.jar
(2623 KB at 1900.5 KB/sec)
[INFO] 
[INFO] --- maven-clean-plugin:2.4.1:clean (default-clean) @ tez-dag-api ---
[INFO] 
[INFO] --- hadoop-maven-plugins:3.0.0-SNAPSHOT:protoc (compile-protoc) @ tez-dag-api ---
[INFO] ------------------------------------------------------------------------
[INFO] Reactor Summary:
[INFO] 
[INFO] tez ............................................... SUCCESS [5.180s]
[INFO] tez-dag-api ....................................... FAILURE [6.136s]
[INFO] tez-common ........................................ SKIPPED
[INFO] tez-engine-api .................................... SKIPPED
[INFO] tez-engine ........................................ SKIPPED
[INFO] tez-mapreduce ..................................... SKIPPED
[INFO] tez-yarn-client ................................... SKIPPED
[INFO] tez-dag ........................................... SKIPPED
[INFO] tez-mapreduce-examples ............................ SKIPPED
[INFO] tez-mapreduce-tests ............................... SKIPPED
[INFO] tez-dist .......................................... SKIPPED
[INFO] Tez ............................................... SKIPPED
[INFO] ------------------------------------------------------------------------
[INFO] BUILD FAILURE
[INFO] ------------------------------------------------------------------------
[INFO] Total time: 11.742s
[INFO] Finished at: Tue Aug 13 22:50:57 UTC 2013
[INFO] Final Memory: 9M/76M
[INFO] ------------------------------------------------------------------------
[ERROR] Failed to execute goal org.apache.hadoop:hadoop-maven-plugins:3.0.0-SNAPSHOT:protoc
(compile-protoc) on project tez-dag-api: The parameters 'protocVersion' for goal org.apache.hadoop:hadoop-maven-plugins:3.0.0-SNAPSHOT:protoc
are missing or invalid -> [Help 1]
[ERROR] 
[ERROR] To see the full stack trace of the errors, re-run Maven with the -e switch.
[ERROR] Re-run Maven using the -X switch to enable full debug logging.
[ERROR] 
[ERROR] For more information about the errors and possible solutions, please read the following
articles:
[ERROR] [Help 1] http://cwiki.apache.org/confluence/display/MAVEN/PluginParameterException
[ERROR] 
[ERROR] After correcting the problems, you can resume the build with the command
[ERROR]   mvn <goals> -rf :tez-dag-api
Build step 'Execute shell' marked build as failure
Archiving artifacts
Recording test results

Mime
View raw message