tez-dev mailing list archives

Site index · List index
Message view « Date » · « Thread »
Top « Date » · « Thread »
From Apache Jenkins Server <jenk...@builds.apache.org>
Subject Build failed in Jenkins: Tez-Build #103
Date Mon, 19 Aug 2013 23:55:24 GMT
See <https://builds.apache.org/job/Tez-Build/103/changes>

Changes:

[hitesh] TEZ-374. YarnTezDagChild strips important debugging information. (Mark Wagner via
hitesh)

------------------------------------------
[...truncated 1489 lines...]
[INFO] Nothing to compile - all classes are up to date
[INFO] 
[INFO] --- maven-resources-plugin:2.4.3:testResources (default-testResources) @ tez-mapreduce-examples
---
[WARNING] Using platform encoding (ISO-8859-1 actually) to copy filtered resources, i.e. build
is platform dependent!
[INFO] skip non existing resourceDirectory <https://builds.apache.org/job/Tez-Build/ws/tez-mapreduce-examples/src/test/resources>
[INFO] 
[INFO] --- maven-compiler-plugin:2.3.2:testCompile (default-testCompile) @ tez-mapreduce-examples
---
[INFO] Nothing to compile - all classes are up to date
[INFO] 
[INFO] --- maven-surefire-plugin:2.14.1:test (default-test) @ tez-mapreduce-examples ---
[INFO] Skipping execution of surefire because it has already been run for this configuration
[INFO] 
[INFO] --- maven-jar-plugin:2.3.1:jar (default-jar) @ tez-mapreduce-examples ---
[INFO] Building jar: <https://builds.apache.org/job/Tez-Build/ws/tez-mapreduce-examples/target/tez-mapreduce-examples-0.2.0-SNAPSHOT.jar>
[INFO] 
[INFO] --- maven-jar-plugin:2.3.1:test-jar (default) @ tez-mapreduce-examples ---
[INFO] Building jar: <https://builds.apache.org/job/Tez-Build/ws/tez-mapreduce-examples/target/tez-mapreduce-examples-0.2.0-SNAPSHOT-tests.jar>
[INFO]                                                                         
[INFO] ------------------------------------------------------------------------
[INFO] Building tez-mapreduce-tests 0.2.0-SNAPSHOT
[INFO] ------------------------------------------------------------------------
[INFO] 
[INFO] --- maven-clean-plugin:2.4.1:clean (default-clean) @ tez-mapreduce-tests ---
[INFO] Deleting <https://builds.apache.org/job/Tez-Build/ws/tez-mapreduce-tests/target>
[INFO] 
[INFO] --- maven-resources-plugin:2.4.3:resources (default-resources) @ tez-mapreduce-tests
---
[WARNING] Using platform encoding (ISO-8859-1 actually) to copy filtered resources, i.e. build
is platform dependent!
[INFO] skip non existing resourceDirectory <https://builds.apache.org/job/Tez-Build/ws/tez-mapreduce-tests/src/main/resources>
[INFO] 
[INFO] --- maven-compiler-plugin:2.3.2:compile (default-compile) @ tez-mapreduce-tests ---
[INFO] No sources to compile
[INFO] 
[INFO] --- maven-resources-plugin:2.4.3:testResources (default-testResources) @ tez-mapreduce-tests
---
[WARNING] Using platform encoding (ISO-8859-1 actually) to copy filtered resources, i.e. build
is platform dependent!
[INFO] skip non existing resourceDirectory <https://builds.apache.org/job/Tez-Build/ws/tez-mapreduce-tests/src/test/resources>
[INFO] 
[INFO] --- maven-compiler-plugin:2.3.2:testCompile (default-testCompile) @ tez-mapreduce-tests
---
[WARNING] File encoding has not been set, using platform encoding ISO-8859-1, i.e. build is
platform dependent!
[INFO] Compiling 3 source files to <https://builds.apache.org/job/Tez-Build/ws/tez-mapreduce-tests/target/test-classes>
[INFO] 
[INFO] --- maven-surefire-plugin:2.14.1:test (default-test) @ tez-mapreduce-tests ---
[INFO] Surefire report directory: <https://builds.apache.org/job/Tez-Build/ws/tez-mapreduce-tests/target/surefire-reports>

-------------------------------------------------------
 T E S T S
-------------------------------------------------------

-------------------------------------------------------
 T E S T S
-------------------------------------------------------
Running org.apache.tez.mapreduce.TestMRRJobsDAGApi
Tests run: 2, Failures: 0, Errors: 0, Skipped: 0, Time elapsed: 47.07 sec
Running org.apache.tez.mapreduce.TestMRRJobs
Tests run: 5, Failures: 0, Errors: 0, Skipped: 0, Time elapsed: 118.503 sec

Results :

Tests run: 7, Failures: 0, Errors: 0, Skipped: 0

[INFO] 
[INFO] --- maven-resources-plugin:2.4.3:resources (default-resources) @ tez-mapreduce-tests
---
[WARNING] Using platform encoding (ISO-8859-1 actually) to copy filtered resources, i.e. build
is platform dependent!
[INFO] skip non existing resourceDirectory <https://builds.apache.org/job/Tez-Build/ws/tez-mapreduce-tests/src/main/resources>
[INFO] 
[INFO] --- maven-compiler-plugin:2.3.2:compile (default-compile) @ tez-mapreduce-tests ---
[INFO] No sources to compile
[INFO] 
[INFO] --- maven-resources-plugin:2.4.3:testResources (default-testResources) @ tez-mapreduce-tests
---
[WARNING] Using platform encoding (ISO-8859-1 actually) to copy filtered resources, i.e. build
is platform dependent!
[INFO] skip non existing resourceDirectory <https://builds.apache.org/job/Tez-Build/ws/tez-mapreduce-tests/src/test/resources>
[INFO] 
[INFO] --- maven-compiler-plugin:2.3.2:testCompile (default-testCompile) @ tez-mapreduce-tests
---
[INFO] Nothing to compile - all classes are up to date
[INFO] 
[INFO] --- maven-surefire-plugin:2.14.1:test (default-test) @ tez-mapreduce-tests ---
[INFO] Skipping execution of surefire because it has already been run for this configuration
[INFO] 
[INFO] --- maven-jar-plugin:2.3.1:jar (default-jar) @ tez-mapreduce-tests ---
[WARNING] JAR will be empty - no content was marked for inclusion!
[INFO] Building jar: <https://builds.apache.org/job/Tez-Build/ws/tez-mapreduce-tests/target/tez-mapreduce-tests-0.2.0-SNAPSHOT.jar>
[INFO] 
[INFO] --- maven-jar-plugin:2.3.1:test-jar (default) @ tez-mapreduce-tests ---
[INFO] Building jar: <https://builds.apache.org/job/Tez-Build/ws/tez-mapreduce-tests/target/tez-mapreduce-tests-0.2.0-SNAPSHOT-tests.jar>
[INFO] 
[INFO] --- maven-install-plugin:2.3.1:install (default-install) @ tez-mapreduce-tests ---
[INFO] Installing <https://builds.apache.org/job/Tez-Build/ws/tez-mapreduce-tests/target/tez-mapreduce-tests-0.2.0-SNAPSHOT.jar>
to /home/jenkins/.m2/repository/org/apache/tez/tez-mapreduce-tests/0.2.0-SNAPSHOT/tez-mapreduce-tests-0.2.0-SNAPSHOT.jar
[INFO] Installing <https://builds.apache.org/job/Tez-Build/ws/tez-mapreduce-tests/pom.xml>
to /home/jenkins/.m2/repository/org/apache/tez/tez-mapreduce-tests/0.2.0-SNAPSHOT/tez-mapreduce-tests-0.2.0-SNAPSHOT.pom
[INFO] Installing <https://builds.apache.org/job/Tez-Build/ws/tez-mapreduce-tests/target/tez-mapreduce-tests-0.2.0-SNAPSHOT-tests.jar>
to /home/jenkins/.m2/repository/org/apache/tez/tez-mapreduce-tests/0.2.0-SNAPSHOT/tez-mapreduce-tests-0.2.0-SNAPSHOT-tests.jar
[INFO] 
[INFO] --- maven-deploy-plugin:2.5:deploy (default-deploy) @ tez-mapreduce-tests ---
Downloading: https://repository.apache.org/content/repositories/snapshots/org/apache/tez/tez-mapreduce-tests/0.2.0-SNAPSHOT/maven-metadata.xml
999 B    
        
Downloaded: https://repository.apache.org/content/repositories/snapshots/org/apache/tez/tez-mapreduce-tests/0.2.0-SNAPSHOT/maven-metadata.xml
(999 B at 2.5 KB/sec)
Uploading: https://repository.apache.org/content/repositories/snapshots/org/apache/tez/tez-mapreduce-tests/0.2.0-SNAPSHOT/tez-mapreduce-tests-0.2.0-20130819.235503-16.jar
3 KB    
       
Uploaded: https://repository.apache.org/content/repositories/snapshots/org/apache/tez/tez-mapreduce-tests/0.2.0-SNAPSHOT/tez-mapreduce-tests-0.2.0-20130819.235503-16.jar
(3 KB at 8.6 KB/sec)
Uploading: https://repository.apache.org/content/repositories/snapshots/org/apache/tez/tez-mapreduce-tests/0.2.0-SNAPSHOT/tez-mapreduce-tests-0.2.0-20130819.235503-16.pom
4 KB   
       
Uploaded: https://repository.apache.org/content/repositories/snapshots/org/apache/tez/tez-mapreduce-tests/0.2.0-SNAPSHOT/tez-mapreduce-tests-0.2.0-20130819.235503-16.pom
(4 KB at 18.9 KB/sec)
Downloading: https://repository.apache.org/content/repositories/snapshots/org/apache/tez/tez-mapreduce-tests/maven-metadata.xml
293 B   
        
Downloaded: https://repository.apache.org/content/repositories/snapshots/org/apache/tez/tez-mapreduce-tests/maven-metadata.xml
(293 B at 1.0 KB/sec)
Uploading: https://repository.apache.org/content/repositories/snapshots/org/apache/tez/tez-mapreduce-tests/0.2.0-SNAPSHOT/maven-metadata.xml
999 B   
        
Uploaded: https://repository.apache.org/content/repositories/snapshots/org/apache/tez/tez-mapreduce-tests/0.2.0-SNAPSHOT/maven-metadata.xml
(999 B at 3.4 KB/sec)
Uploading: https://repository.apache.org/content/repositories/snapshots/org/apache/tez/tez-mapreduce-tests/maven-metadata.xml
293 B   
        
Uploaded: https://repository.apache.org/content/repositories/snapshots/org/apache/tez/tez-mapreduce-tests/maven-metadata.xml
(293 B at 1.0 KB/sec)
Uploading: https://repository.apache.org/content/repositories/snapshots/org/apache/tez/tez-mapreduce-tests/0.2.0-SNAPSHOT/tez-mapreduce-tests-0.2.0-20130819.235503-16-tests.jar
4 KB    
8 KB   
12 KB   
16 KB   
17 KB   
        
Uploaded: https://repository.apache.org/content/repositories/snapshots/org/apache/tez/tez-mapreduce-tests/0.2.0-SNAPSHOT/tez-mapreduce-tests-0.2.0-20130819.235503-16-tests.jar
(17 KB at 62.2 KB/sec)
Uploading: https://repository.apache.org/content/repositories/snapshots/org/apache/tez/tez-mapreduce-tests/0.2.0-SNAPSHOT/maven-metadata.xml
999 B   
        
Uploaded: https://repository.apache.org/content/repositories/snapshots/org/apache/tez/tez-mapreduce-tests/0.2.0-SNAPSHOT/maven-metadata.xml
(999 B at 6.0 KB/sec)
[INFO] 
[INFO] --- maven-resources-plugin:2.4.3:resources (default-resources) @ tez-mapreduce-tests
---
[WARNING] Using platform encoding (ISO-8859-1 actually) to copy filtered resources, i.e. build
is platform dependent!
[INFO] skip non existing resourceDirectory <https://builds.apache.org/job/Tez-Build/ws/tez-mapreduce-tests/src/main/resources>
[INFO] 
[INFO] --- maven-compiler-plugin:2.3.2:compile (default-compile) @ tez-mapreduce-tests ---
[INFO] No sources to compile
[INFO] 
[INFO] --- maven-resources-plugin:2.4.3:testResources (default-testResources) @ tez-mapreduce-tests
---
[WARNING] Using platform encoding (ISO-8859-1 actually) to copy filtered resources, i.e. build
is platform dependent!
[INFO] skip non existing resourceDirectory <https://builds.apache.org/job/Tez-Build/ws/tez-mapreduce-tests/src/test/resources>
[INFO] 
[INFO] --- maven-compiler-plugin:2.3.2:testCompile (default-testCompile) @ tez-mapreduce-tests
---
[INFO] Nothing to compile - all classes are up to date
[INFO] 
[INFO] --- maven-surefire-plugin:2.14.1:test (default-test) @ tez-mapreduce-tests ---
[INFO] Skipping execution of surefire because it has already been run for this configuration
[INFO] 
[INFO] --- maven-jar-plugin:2.3.1:jar (default-jar) @ tez-mapreduce-tests ---
[WARNING] JAR will be empty - no content was marked for inclusion!
[INFO] Building jar: <https://builds.apache.org/job/Tez-Build/ws/tez-mapreduce-tests/target/tez-mapreduce-tests-0.2.0-SNAPSHOT.jar>
[INFO] 
[INFO] --- maven-jar-plugin:2.3.1:test-jar (default) @ tez-mapreduce-tests ---
[INFO] Building jar: <https://builds.apache.org/job/Tez-Build/ws/tez-mapreduce-tests/target/tez-mapreduce-tests-0.2.0-SNAPSHOT-tests.jar>
[INFO]                                                                         
[INFO] ------------------------------------------------------------------------
[INFO] Building tez-dist 0.2.0-SNAPSHOT
[INFO] ------------------------------------------------------------------------
[INFO] 
[INFO] --- maven-clean-plugin:2.4.1:clean (default-clean) @ tez-dist ---
[INFO] Deleting <https://builds.apache.org/job/Tez-Build/ws/tez-dist/target>
[INFO] 
[INFO] --- maven-assembly-plugin:2.4:single (package-tez-full) @ tez-dist ---
[INFO] Reading assembly descriptor: src/main/assembly/tez-dist-full.xml
[WARNING] NOTE: Currently, inclusion of module dependencies may produce unpredictable results
if a version conflict occurs.
[INFO] Building tar: <https://builds.apache.org/job/Tez-Build/103/artifact/tez-dist/target/tez-0.2.0-SNAPSHOT-full.tar.gz>
[INFO] 
[INFO] --- maven-assembly-plugin:2.4:single (package-tez) @ tez-dist ---
[INFO] Reading assembly descriptor: src/main/assembly/tez-dist.xml
[WARNING] NOTE: Currently, inclusion of module dependencies may produce unpredictable results
if a version conflict occurs.
[INFO] Building tar: <https://builds.apache.org/job/Tez-Build/103/artifact/tez-dist/target/tez-0.2.0-SNAPSHOT.tar.gz>
[INFO] 
[INFO] --- maven-install-plugin:2.3.1:install (default-install) @ tez-dist ---
[INFO] Installing <https://builds.apache.org/job/Tez-Build/ws/tez-dist/pom.xml> to /home/jenkins/.m2/repository/org/apache/tez/tez-dist/0.2.0-SNAPSHOT/tez-dist-0.2.0-SNAPSHOT.pom
[INFO] 
[INFO] --- maven-deploy-plugin:2.5:deploy (default-deploy) @ tez-dist ---
Downloading: https://repository.apache.org/content/repositories/snapshots/org/apache/tez/tez-dist/0.2.0-SNAPSHOT/maven-metadata.xml
601 B   
        
Downloaded: https://repository.apache.org/content/repositories/snapshots/org/apache/tez/tez-dist/0.2.0-SNAPSHOT/maven-metadata.xml
(601 B at 1.8 KB/sec)
Uploading: https://repository.apache.org/content/repositories/snapshots/org/apache/tez/tez-dist/0.2.0-SNAPSHOT/tez-dist-0.2.0-20130819.235511-16.pom
4 KB    
5 KB   
       
Uploaded: https://repository.apache.org/content/repositories/snapshots/org/apache/tez/tez-dist/0.2.0-SNAPSHOT/tez-dist-0.2.0-20130819.235511-16.pom
(5 KB at 14.2 KB/sec)
Downloading: https://repository.apache.org/content/repositories/snapshots/org/apache/tez/tez-dist/maven-metadata.xml
282 B   
        
Downloaded: https://repository.apache.org/content/repositories/snapshots/org/apache/tez/tez-dist/maven-metadata.xml
(282 B at 1.4 KB/sec)
Uploading: https://repository.apache.org/content/repositories/snapshots/org/apache/tez/tez-dist/0.2.0-SNAPSHOT/maven-metadata.xml
601 B   
        
Uploaded: https://repository.apache.org/content/repositories/snapshots/org/apache/tez/tez-dist/0.2.0-SNAPSHOT/maven-metadata.xml
(601 B at 2.4 KB/sec)
Uploading: https://repository.apache.org/content/repositories/snapshots/org/apache/tez/tez-dist/maven-metadata.xml
282 B   
        
Uploaded: https://repository.apache.org/content/repositories/snapshots/org/apache/tez/tez-dist/maven-metadata.xml
(282 B at 1.3 KB/sec)
[INFO] 
[INFO] --- maven-assembly-plugin:2.4:single (package-tez-full) @ tez-dist ---
[INFO] Reading assembly descriptor: src/main/assembly/tez-dist-full.xml
[WARNING] NOTE: Currently, inclusion of module dependencies may produce unpredictable results
if a version conflict occurs.
[INFO] Building tar: <https://builds.apache.org/job/Tez-Build/103/artifact/tez-dist/target/tez-0.2.0-SNAPSHOT-full.tar.gz>
[INFO] 
[INFO] --- maven-assembly-plugin:2.4:single (package-tez) @ tez-dist ---
[INFO] Reading assembly descriptor: src/main/assembly/tez-dist.xml
[WARNING] NOTE: Currently, inclusion of module dependencies may produce unpredictable results
if a version conflict occurs.
[INFO] Building tar: <https://builds.apache.org/job/Tez-Build/103/artifact/tez-dist/target/tez-0.2.0-SNAPSHOT.tar.gz>
[INFO]                                                                         
[INFO] ------------------------------------------------------------------------
[INFO] Building Tez 0.2.0-SNAPSHOT
[INFO] ------------------------------------------------------------------------
[INFO] 
[INFO] --- maven-clean-plugin:2.4.1:clean (default-clean) @ tez-docs ---
[INFO] 
[INFO] --- maven-install-plugin:2.3.1:install (default-install) @ tez-docs ---
[INFO] Installing <https://builds.apache.org/job/Tez-Build/ws/docs/pom.xml> to /home/jenkins/.m2/repository/org/apache/tez/tez-docs/0.2.0-SNAPSHOT/tez-docs-0.2.0-SNAPSHOT.pom
[INFO] 
[INFO] --- maven-deploy-plugin:2.5:deploy (default-deploy) @ tez-docs ---
[INFO] ------------------------------------------------------------------------
[INFO] Reactor Summary:
[INFO] 
[INFO] tez ............................................... SUCCESS [2.936s]
[INFO] tez-dag-api ....................................... SUCCESS [18.047s]
[INFO] tez-common ........................................ SUCCESS [5.519s]
[INFO] tez-engine-api .................................... SUCCESS [2.676s]
[INFO] tez-engine ........................................ SUCCESS [5.214s]
[INFO] tez-mapreduce ..................................... SUCCESS [17.395s]
[INFO] tez-yarn-client ................................... SUCCESS [3.533s]
[INFO] tez-dag ........................................... SUCCESS [26.759s]
[INFO] tez-mapreduce-examples ............................ SUCCESS [5.486s]
[INFO] tez-mapreduce-tests ............................... SUCCESS [2:49.302s]
[INFO] tez-dist .......................................... SUCCESS [10.752s]
[INFO] Tez ............................................... FAILURE [0.094s]
[INFO] ------------------------------------------------------------------------
[INFO] BUILD FAILURE
[INFO] ------------------------------------------------------------------------
[INFO] Total time: 4:28.001s
[INFO] Finished at: Mon Aug 19 23:55:16 UTC 2013
[INFO] Final Memory: 123M/832M
[INFO] ------------------------------------------------------------------------
[ERROR] Failed to execute goal org.apache.maven.plugins:maven-deploy-plugin:2.5:deploy (default-deploy)
on project tez-docs: Deployment failed: repository element was not specified in the POM inside
distributionManagement element or in -DaltDeploymentRepository=id::layout::url parameter ->
[Help 1]
[ERROR] 
[ERROR] To see the full stack trace of the errors, re-run Maven with the -e switch.
[ERROR] Re-run Maven using the -X switch to enable full debug logging.
[ERROR] 
[ERROR] For more information about the errors and possible solutions, please read the following
articles:
[ERROR] [Help 1] http://cwiki.apache.org/confluence/display/MAVEN/MojoExecutionException
[ERROR] 
[ERROR] After correcting the problems, you can resume the build with the command
[ERROR]   mvn <goals> -rf :tez-docs
Build step 'Execute shell' marked build as failure
Archiving artifacts
Recording test results

Mime
View raw message