tez-dev mailing list archives

Site index · List index
Message view « Date » · « Thread »
Top « Date » · « Thread »
From Apache Jenkins Server <jenk...@builds.apache.org>
Subject Build failed in Jenkins: Tez-Build #99
Date Wed, 14 Aug 2013 21:51:02 GMT
See <https://builds.apache.org/job/Tez-Build/99/changes>

Changes:

[sseth] TEZ-354. Make user payload an optional field for

------------------------------------------
Started by an SCM change
Building remotely on hadoop9 in workspace <https://builds.apache.org/job/Tez-Build/ws/>
Checkout:Tez-Build / <https://builds.apache.org/job/Tez-Build/ws/> - hudson.remoting.Channel@8789d8a:hadoop9
Using strategy: Default
Last Built Revision: Revision a9b6ab16b8a7bb527881479886bc80750ba01f97 (origin/master)
Fetching changes from 1 remote Git repository
Fetching upstream changes from origin
Commencing build of Revision 15a411e716b49fa33101ea12e00f42451fa95726 (origin/master)
Checking out Revision 15a411e716b49fa33101ea12e00f42451fa95726 (origin/master)
[Tez-Build] $ /bin/bash -x /tmp/hudson6598486479084055385.sh
+ export JAVA_HOME=/home/hudson/tools/java/latest
+ JAVA_HOME=/home/hudson/tools/java/latest
+ export MAVEN_HOME=/home/hudson/tools/maven/latest
+ MAVEN_HOME=/home/hudson/tools/maven/latest
+ export PATH=/home/hudson/tools/java/latest/bin:/home/hudson/tools/maven/latest/bin:/home/hudson/tools/java/latest1.6/bin:/home/hudson/tools/java/latest1.6/bin:/usr/local/sbin:/usr/local/bin:/usr/sbin:/usr/bin:/sbin:/bin:/usr/games
+ PATH=/home/hudson/tools/java/latest/bin:/home/hudson/tools/maven/latest/bin:/home/hudson/tools/java/latest1.6/bin:/home/hudson/tools/java/latest1.6/bin:/usr/local/sbin:/usr/local/bin:/usr/sbin:/usr/bin:/sbin:/bin:/usr/games
+ env
BUILD_URL=https://builds.apache.org/job/Tez-Build/99/
HUDSON_SERVER_COOKIE=f4ebd1e6b0d976e8
SHELL=/bin/bash
SSH_CLIENT=140.211.11.8 44381 22
BUILD_TAG=jenkins-Tez-Build-99
GIT_PREVIOUS_COMMIT=a9b6ab16b8a7bb527881479886bc80750ba01f97
WORKSPACE=<https://builds.apache.org/job/Tez-Build/ws/>
JOB_URL=https://builds.apache.org/job/Tez-Build/
USER=jenkins
LD_LIBRARY_PATH=/home/jenkins/tools/java/jdk1.6.0_26/jre/lib/i386/server:/home/jenkins/tools/java/jdk1.6.0_26/jre/lib/i386:/home/jenkins/tools/java/jdk1.6.0_26/jre/../lib/i386
NLSPATH=/usr/dt/lib/nls/msg/%L/%N.cat
GIT_COMMIT=15a411e716b49fa33101ea12e00f42451fa95726
JENKINS_HOME=/home/hudson/hudson
MAVEN_HOME=/home/hudson/tools/maven/latest
PATH=/home/hudson/tools/java/latest/bin:/home/hudson/tools/maven/latest/bin:/home/hudson/tools/java/latest1.6/bin:/home/hudson/tools/java/latest1.6/bin:/usr/local/sbin:/usr/local/bin:/usr/sbin:/usr/bin:/sbin:/bin:/usr/games
MAIL=/var/mail/jenkins
PWD=<https://builds.apache.org/job/Tez-Build/ws/>
JAVA_HOME=/home/hudson/tools/java/latest
HUDSON_URL=https://builds.apache.org/
LANG=en_US
JOB_NAME=Tez-Build
BUILD_DISPLAY_NAME=#99
XFILESEARCHPATH=/usr/dt/app-defaults/%L/Dt
JENKINS_URL=https://builds.apache.org/
BUILD_ID=2013-08-14_21-50-43
HOME=/home/jenkins
SHLVL=2
GIT_BRANCH=origin/master
JENKINS_SERVER_COOKIE=f4ebd1e6b0d976e8
EXECUTOR_NUMBER=0
GIT_URL=http://git-wip-us.apache.org/repos/asf/incubator-tez.git
NODE_LABELS=Hadoop Hadoop9 Zookeeper hadoop hadoop9
LOGNAME=jenkins
HUDSON_HOME=/home/hudson/hudson
SSH_CONNECTION=140.211.11.8 44381 67.195.138.22 22
NODE_NAME=hadoop9
BUILD_NUMBER=99
HUDSON_COOKIE=a06de276-e72b-475b-8887-923dcbe173c9
_=/usr/bin/env
+ export MAVEN_OPTS=-Xmx2048m
+ MAVEN_OPTS=-Xmx2048m
+ /home/hudson/tools/maven/latest/bin/mvn clean test deploy package -Dtar
[INFO] Scanning for projects...
[INFO] ------------------------------------------------------------------------
[INFO] Reactor Build Order:
[INFO] 
[INFO] tez
[INFO] tez-dag-api
[INFO] tez-common
[INFO] tez-engine-api
[INFO] tez-engine
[INFO] tez-mapreduce
[INFO] tez-yarn-client
[INFO] tez-dag
[INFO] tez-mapreduce-examples
[INFO] tez-mapreduce-tests
[INFO] tez-dist
[INFO] Tez
[INFO]                                                                         
[INFO] ------------------------------------------------------------------------
[INFO] Building tez 0.2.0-SNAPSHOT
[INFO] ------------------------------------------------------------------------
[INFO] 
[INFO] --- maven-clean-plugin:2.4.1:clean (default-clean) @ tez ---
[INFO] 
[INFO] --- maven-install-plugin:2.3.1:install (default-install) @ tez ---
[INFO] Installing <https://builds.apache.org/job/Tez-Build/ws/pom.xml> to /home/jenkins/.m2/repository/org/apache/tez/tez/0.2.0-SNAPSHOT/tez-0.2.0-SNAPSHOT.pom
[INFO] 
[INFO] --- maven-deploy-plugin:2.5:deploy (default-deploy) @ tez ---
Downloading: https://repository.apache.org/content/repositories/snapshots/org/apache/tez/tez/0.2.0-SNAPSHOT/maven-metadata.xml
596 B   
        
Downloaded: https://repository.apache.org/content/repositories/snapshots/org/apache/tez/tez/0.2.0-SNAPSHOT/maven-metadata.xml
(596 B at 0.7 KB/sec)
Uploading: https://repository.apache.org/content/repositories/snapshots/org/apache/tez/tez/0.2.0-SNAPSHOT/tez-0.2.0-20130814.215054-64.pom
4 KB    
8 KB   
12 KB   
14 KB   
        
Uploaded: https://repository.apache.org/content/repositories/snapshots/org/apache/tez/tez/0.2.0-SNAPSHOT/tez-0.2.0-20130814.215054-64.pom
(14 KB at 25.6 KB/sec)
Downloading: https://repository.apache.org/content/repositories/snapshots/org/apache/tez/tez/maven-metadata.xml
277 B   
        
Downloaded: https://repository.apache.org/content/repositories/snapshots/org/apache/tez/tez/maven-metadata.xml
(277 B at 1.0 KB/sec)
Uploading: https://repository.apache.org/content/repositories/snapshots/org/apache/tez/tez/0.2.0-SNAPSHOT/maven-metadata.xml
596 B   
        
Uploaded: https://repository.apache.org/content/repositories/snapshots/org/apache/tez/tez/0.2.0-SNAPSHOT/maven-metadata.xml
(596 B at 1.6 KB/sec)
Uploading: https://repository.apache.org/content/repositories/snapshots/org/apache/tez/tez/maven-metadata.xml
277 B   
        
Uploaded: https://repository.apache.org/content/repositories/snapshots/org/apache/tez/tez/maven-metadata.xml
(277 B at 0.7 KB/sec)
[INFO]                                                                         
[INFO] ------------------------------------------------------------------------
[INFO] Building tez-dag-api 0.2.0-SNAPSHOT
[INFO] ------------------------------------------------------------------------
Downloading: https://repository.apache.org/content/repositories/snapshots/org/slf4j/slf4j-api/1.6.4/slf4j-api-1.6.4.pom
        
Downloading: http://repo1.maven.org/maven2/org/slf4j/slf4j-api/1.6.4/slf4j-api-1.6.4.pom
3 KB    
       
Downloaded: http://repo1.maven.org/maven2/org/slf4j/slf4j-api/1.6.4/slf4j-api-1.6.4.pom (3
KB at 57.1 KB/sec)
Downloading: https://repository.apache.org/content/repositories/snapshots/org/slf4j/slf4j-parent/1.6.4/slf4j-parent-1.6.4.pom
       
Downloading: http://repo1.maven.org/maven2/org/slf4j/slf4j-parent/1.6.4/slf4j-parent-1.6.4.pom
4 KB   
8 KB   
12 KB   
        
Downloaded: http://repo1.maven.org/maven2/org/slf4j/slf4j-parent/1.6.4/slf4j-parent-1.6.4.pom
(12 KB at 1986.2 KB/sec)
[INFO] 
[INFO] --- maven-clean-plugin:2.4.1:clean (default-clean) @ tez-dag-api ---
[INFO] Deleting <https://builds.apache.org/job/Tez-Build/ws/tez-dag-api/target>
[INFO] 
[INFO] --- hadoop-maven-plugins:3.0.0-SNAPSHOT:protoc (compile-protoc) @ tez-dag-api ---
[INFO] ------------------------------------------------------------------------
[INFO] Reactor Summary:
[INFO] 
[INFO] tez ............................................... SUCCESS [2.898s]
[INFO] tez-dag-api ....................................... FAILURE [1.528s]
[INFO] tez-common ........................................ SKIPPED
[INFO] tez-engine-api .................................... SKIPPED
[INFO] tez-engine ........................................ SKIPPED
[INFO] tez-mapreduce ..................................... SKIPPED
[INFO] tez-yarn-client ................................... SKIPPED
[INFO] tez-dag ........................................... SKIPPED
[INFO] tez-mapreduce-examples ............................ SKIPPED
[INFO] tez-mapreduce-tests ............................... SKIPPED
[INFO] tez-dist .......................................... SKIPPED
[INFO] Tez ............................................... SKIPPED
[INFO] ------------------------------------------------------------------------
[INFO] BUILD FAILURE
[INFO] ------------------------------------------------------------------------
[INFO] Total time: 4.727s
[INFO] Finished at: Wed Aug 14 21:50:57 UTC 2013
[INFO] Final Memory: 9M/113M
[INFO] ------------------------------------------------------------------------
[ERROR] Failed to execute goal org.apache.hadoop:hadoop-maven-plugins:3.0.0-SNAPSHOT:protoc
(compile-protoc) on project tez-dag-api: The parameters 'protocVersion' for goal org.apache.hadoop:hadoop-maven-plugins:3.0.0-SNAPSHOT:protoc
are missing or invalid -> [Help 1]
[ERROR] 
[ERROR] To see the full stack trace of the errors, re-run Maven with the -e switch.
[ERROR] Re-run Maven using the -X switch to enable full debug logging.
[ERROR] 
[ERROR] For more information about the errors and possible solutions, please read the following
articles:
[ERROR] [Help 1] http://cwiki.apache.org/confluence/display/MAVEN/PluginParameterException
[ERROR] 
[ERROR] After correcting the problems, you can resume the build with the command
[ERROR]   mvn <goals> -rf :tez-dag-api
Build step 'Execute shell' marked build as failure
Archiving artifacts
Recording test results

Mime
View raw message