tez-dev mailing list archives

Site index · List index
Message view « Date » · « Thread »
Top « Date » · « Thread »
From Apache Jenkins Server <jenk...@builds.apache.org>
Subject Build failed in Jenkins: Tez-Build #114
Date Mon, 26 Aug 2013 20:51:59 GMT
See <https://builds.apache.org/job/Tez-Build/114/changes>

Changes:

[sseth] TEZ-396. SimpleInput should be initialized before the processor and

------------------------------------------
[...truncated 1206 lines...]
[INFO] No tests to run.
[INFO] 
[INFO] --- maven-resources-plugin:2.6:resources (default-resources) @ tez-yarn-client ---
[INFO] Using 'UTF-8' encoding to copy filtered resources.
[INFO] Copying 1 resource
[INFO] 
[INFO] --- maven-compiler-plugin:2.3.2:compile (default-compile) @ tez-yarn-client ---
[INFO] Nothing to compile - all classes are up to date
[INFO] 
[INFO] --- maven-resources-plugin:2.6:testResources (default-testResources) @ tez-yarn-client
---
[INFO] Using 'UTF-8' encoding to copy filtered resources.
[INFO] skip non existing resourceDirectory <https://builds.apache.org/job/Tez-Build/ws/tez-yarn-client/src/test/resources>
[INFO] 
[INFO] --- maven-compiler-plugin:2.3.2:testCompile (default-testCompile) @ tez-yarn-client
---
[INFO] No sources to compile
[INFO] 
[INFO] --- maven-surefire-plugin:2.14.1:test (default-test) @ tez-yarn-client ---
[INFO] No tests to run.
[INFO] Skipping execution of surefire because it has already been run for this configuration
[INFO] 
[INFO] --- maven-jar-plugin:2.3.1:jar (default-jar) @ tez-yarn-client ---
[INFO] Building jar: <https://builds.apache.org/job/Tez-Build/ws/tez-yarn-client/target/tez-yarn-client-0.2.0-SNAPSHOT.jar>
[INFO] 
[INFO] --- maven-jar-plugin:2.3.1:test-jar (default) @ tez-yarn-client ---
[WARNING] JAR will be empty - no content was marked for inclusion!
[INFO] Building jar: <https://builds.apache.org/job/Tez-Build/ws/tez-yarn-client/target/tez-yarn-client-0.2.0-SNAPSHOT-tests.jar>
[INFO] 
[INFO] --- maven-install-plugin:2.3.1:install (default-install) @ tez-yarn-client ---
[INFO] Installing <https://builds.apache.org/job/Tez-Build/ws/tez-yarn-client/target/tez-yarn-client-0.2.0-SNAPSHOT.jar>
to /home/jenkins/.m2/repository/org/apache/tez/tez-yarn-client/0.2.0-SNAPSHOT/tez-yarn-client-0.2.0-SNAPSHOT.jar
[INFO] Installing <https://builds.apache.org/job/Tez-Build/ws/tez-yarn-client/pom.xml>
to /home/jenkins/.m2/repository/org/apache/tez/tez-yarn-client/0.2.0-SNAPSHOT/tez-yarn-client-0.2.0-SNAPSHOT.pom
[INFO] Installing <https://builds.apache.org/job/Tez-Build/ws/tez-yarn-client/target/tez-yarn-client-0.2.0-SNAPSHOT-tests.jar>
to /home/jenkins/.m2/repository/org/apache/tez/tez-yarn-client/0.2.0-SNAPSHOT/tez-yarn-client-0.2.0-SNAPSHOT-tests.jar
[INFO] 
[INFO] --- maven-deploy-plugin:2.7:deploy (default-deploy) @ tez-yarn-client ---
Downloading: https://repository.apache.org/content/repositories/snapshots/org/apache/tez/tez-yarn-client/0.2.0-SNAPSHOT/maven-metadata.xml
995 B       
        
Downloaded: https://repository.apache.org/content/repositories/snapshots/org/apache/tez/tez-yarn-client/0.2.0-SNAPSHOT/maven-metadata.xml
(995 B at 1.5 KB/sec)
Uploading: https://repository.apache.org/content/repositories/snapshots/org/apache/tez/tez-yarn-client/0.2.0-SNAPSHOT/tez-yarn-client-0.2.0-20130826.205127-68.jar
2/28 KB   
4/28 KB   
6/28 KB   
8/28 KB   
10/28 KB   
12/28 KB   
14/28 KB   
16/28 KB   
18/28 KB   
20/28 KB   
22/28 KB   
24/28 KB   
26/28 KB   
28/28 KB   
           
Uploaded: https://repository.apache.org/content/repositories/snapshots/org/apache/tez/tez-yarn-client/0.2.0-SNAPSHOT/tez-yarn-client-0.2.0-20130826.205127-68.jar
(28 KB at 80.7 KB/sec)
Uploading: https://repository.apache.org/content/repositories/snapshots/org/apache/tez/tez-yarn-client/0.2.0-SNAPSHOT/tez-yarn-client-0.2.0-20130826.205127-68.pom
2/3 KB     
3/3 KB   
         
Uploaded: https://repository.apache.org/content/repositories/snapshots/org/apache/tez/tez-yarn-client/0.2.0-SNAPSHOT/tez-yarn-client-0.2.0-20130826.205127-68.pom
(3 KB at 6.6 KB/sec)
Downloading: https://repository.apache.org/content/repositories/snapshots/org/apache/tez/tez-yarn-client/maven-metadata.xml
289 B    
        
Downloaded: https://repository.apache.org/content/repositories/snapshots/org/apache/tez/tez-yarn-client/maven-metadata.xml
(289 B at 0.7 KB/sec)
Uploading: https://repository.apache.org/content/repositories/snapshots/org/apache/tez/tez-yarn-client/0.2.0-SNAPSHOT/maven-metadata.xml
995/995 B   
            
Uploaded: https://repository.apache.org/content/repositories/snapshots/org/apache/tez/tez-yarn-client/0.2.0-SNAPSHOT/maven-metadata.xml
(995 B at 3.4 KB/sec)
Uploading: https://repository.apache.org/content/repositories/snapshots/org/apache/tez/tez-yarn-client/maven-metadata.xml
289/289 B   
            
Uploaded: https://repository.apache.org/content/repositories/snapshots/org/apache/tez/tez-yarn-client/maven-metadata.xml
(289 B at 0.9 KB/sec)
Uploading: https://repository.apache.org/content/repositories/snapshots/org/apache/tez/tez-yarn-client/0.2.0-SNAPSHOT/tez-yarn-client-0.2.0-20130826.205127-68-tests.jar
2/3 KB      
3/3 KB   
         
Uploaded: https://repository.apache.org/content/repositories/snapshots/org/apache/tez/tez-yarn-client/0.2.0-SNAPSHOT/tez-yarn-client-0.2.0-20130826.205127-68-tests.jar
(3 KB at 6.4 KB/sec)
Uploading: https://repository.apache.org/content/repositories/snapshots/org/apache/tez/tez-yarn-client/0.2.0-SNAPSHOT/maven-metadata.xml
995/995 B   
            
Uploaded: https://repository.apache.org/content/repositories/snapshots/org/apache/tez/tez-yarn-client/0.2.0-SNAPSHOT/maven-metadata.xml
(995 B at 2.8 KB/sec)
[INFO] 
[INFO] --- maven-resources-plugin:2.6:resources (default-resources) @ tez-yarn-client ---
[INFO] Using 'UTF-8' encoding to copy filtered resources.
[INFO] Copying 1 resource
[INFO] 
[INFO] --- maven-compiler-plugin:2.3.2:compile (default-compile) @ tez-yarn-client ---
[INFO] Nothing to compile - all classes are up to date
[INFO] 
[INFO] --- maven-resources-plugin:2.6:testResources (default-testResources) @ tez-yarn-client
---
[INFO] Using 'UTF-8' encoding to copy filtered resources.
[INFO] skip non existing resourceDirectory <https://builds.apache.org/job/Tez-Build/ws/tez-yarn-client/src/test/resources>
[INFO] 
[INFO] --- maven-compiler-plugin:2.3.2:testCompile (default-testCompile) @ tez-yarn-client
---
[INFO] No sources to compile
[INFO] 
[INFO] --- maven-surefire-plugin:2.14.1:test (default-test) @ tez-yarn-client ---
[INFO] No tests to run.
[INFO] Skipping execution of surefire because it has already been run for this configuration
[INFO] 
[INFO] --- maven-jar-plugin:2.3.1:jar (default-jar) @ tez-yarn-client ---
[INFO] Building jar: <https://builds.apache.org/job/Tez-Build/ws/tez-yarn-client/target/tez-yarn-client-0.2.0-SNAPSHOT.jar>
[INFO] 
[INFO] --- maven-jar-plugin:2.3.1:test-jar (default) @ tez-yarn-client ---
[WARNING] JAR will be empty - no content was marked for inclusion!
[INFO] Building jar: <https://builds.apache.org/job/Tez-Build/ws/tez-yarn-client/target/tez-yarn-client-0.2.0-SNAPSHOT-tests.jar>
[INFO]                                                                         
[INFO] ------------------------------------------------------------------------
[INFO] Building tez-dag 0.2.0-SNAPSHOT
[INFO] ------------------------------------------------------------------------
[INFO] 
[INFO] --- maven-clean-plugin:2.4.1:clean (default-clean) @ tez-dag ---
[INFO] Deleting <https://builds.apache.org/job/Tez-Build/ws/tez-dag/target>
[INFO] 
[INFO] --- avro-maven-plugin:1.5.3:protocol (default) @ tez-dag ---
[INFO] 
[INFO] --- maven-resources-plugin:2.6:resources (default-resources) @ tez-dag ---
[INFO] Using 'UTF-8' encoding to copy filtered resources.
[INFO] Copying 2 resources
[INFO] 
[INFO] --- maven-compiler-plugin:2.3.2:compile (default-compile) @ tez-dag ---
[WARNING] File encoding has not been set, using platform encoding ISO-8859-1, i.e. build is
platform dependent!
[INFO] Compiling 199 source files to <https://builds.apache.org/job/Tez-Build/ws/tez-dag/target/classes>
[INFO] 
[INFO] --- maven-resources-plugin:2.6:testResources (default-testResources) @ tez-dag ---
[INFO] Using 'UTF-8' encoding to copy filtered resources.
[INFO] Copying 1 resource
[INFO] 
[INFO] --- maven-compiler-plugin:2.3.2:testCompile (default-testCompile) @ tez-dag ---
[WARNING] File encoding has not been set, using platform encoding ISO-8859-1, i.e. build is
platform dependent!
[INFO] Compiling 10 source files to <https://builds.apache.org/job/Tez-Build/ws/tez-dag/target/test-classes>
[INFO] 
[INFO] --- maven-surefire-plugin:2.14.1:test (default-test) @ tez-dag ---
[INFO] Surefire report directory: <https://builds.apache.org/job/Tez-Build/ws/tez-dag/target/surefire-reports>

-------------------------------------------------------
 T E S T S
-------------------------------------------------------

-------------------------------------------------------
 T E S T S
-------------------------------------------------------
Running org.apache.tez.dag.app.dag.impl.TestDAGScheduler
Tests run: 2, Failures: 0, Errors: 0, Skipped: 1, Time elapsed: 0.559 sec
Running org.apache.tez.dag.app.dag.impl.TestTaskAttempt
Tests run: 8, Failures: 0, Errors: 0, Skipped: 0, Time elapsed: 1.742 sec
Running org.apache.tez.dag.app.dag.impl.TestVertexScheduler
Tests run: 2, Failures: 0, Errors: 0, Skipped: 0, Time elapsed: 0.674 sec
Running org.apache.tez.dag.app.dag.impl.TestDAGImpl
Tests run: 12, Failures: 0, Errors: 0, Skipped: 1, Time elapsed: 2.059 sec
Running org.apache.tez.dag.app.dag.impl.TestTaskImpl
Tests run: 9, Failures: 0, Errors: 0, Skipped: 0, Time elapsed: 1 sec
Running org.apache.tez.dag.app.dag.impl.TestVertexImpl
Tests run: 27, Failures: 0, Errors: 0, Skipped: 1, Time elapsed: 2.242 sec
Running org.apache.tez.dag.app.rm.container.TestAMContainer
Tests run: 20, Failures: 0, Errors: 0, Skipped: 0, Time elapsed: 0.964 sec
Running org.apache.tez.dag.app.rm.TestContainerReuse
Tests run: 5, Failures: 1, Errors: 0, Skipped: 0, Time elapsed: 4.247 sec <<< FAILURE!
testReuseNonLocalRequest(org.apache.tez.dag.app.rm.TestContainerReuse)  Time elapsed: 0.07
sec  <<< FAILURE!
org.mockito.exceptions.verification.WantedButNotInvoked: 
Wanted but not invoked:
taskSchedulerEventHandlerForTest.taskAllocated(
    Mock for TaskAttempt, hashCode: 22892006,
    <any>,
    Container: [ContainerId: container_1_0001_01_000001, NodeId: randomHost:0, NodeHttpAddress:
randomHost:0, Resource: <memory:1024, vCores:1>, Priority: 3, Token: null, ]
);
-> at org.apache.tez.dag.app.rm.TestContainerReuse.testReuseNonLocalRequest(TestContainerReuse.java:454)

However, there were other interactions with this mock:
-> at org.apache.tez.dag.app.rm.TestContainerReuse.testReuseNonLocalRequest(TestContainerReuse.java:420)
-> at org.apache.tez.dag.app.rm.TestContainerReuse.testReuseNonLocalRequest(TestContainerReuse.java:420)
-> at org.apache.tez.dag.app.rm.TestContainerReuse.testReuseNonLocalRequest(TestContainerReuse.java:420)
-> at org.apache.tez.dag.app.rm.TestContainerReuse.testReuseNonLocalRequest(TestContainerReuse.java:421)
-> at org.apache.tez.dag.app.rm.TestContainerReuse.testReuseNonLocalRequest(TestContainerReuse.java:421)
-> at org.apache.tez.dag.app.rm.TestContainerReuse.testReuseNonLocalRequest(TestContainerReuse.java:421)
-> at org.apache.tez.dag.app.rm.TestContainerReuse.testReuseNonLocalRequest(TestContainerReuse.java:421)
-> at org.apache.tez.dag.app.rm.TestContainerReuse.testReuseNonLocalRequest(TestContainerReuse.java:423)
-> at org.apache.tez.dag.app.rm.TaskSchedulerAppCallbackWrapper$SetApplicationRegistrationDataCallable.call(TaskSchedulerAppCallbackWrapper.java:248)
-> at org.apache.tez.dag.app.rm.TestContainerReuse.testReuseNonLocalRequest(TestContainerReuse.java:448)

	at org.apache.tez.dag.app.rm.TestContainerReuse.testReuseNonLocalRequest(TestContainerReuse.java:454)

Running org.apache.tez.dag.app.rm.TestTaskScheduler
Tests run: 3, Failures: 0, Errors: 0, Skipped: 0, Time elapsed: 1.086 sec

Results :

Failed tests: 
  TestContainerReuse.testReuseNonLocalRequest:454 
Wanted but not invoked:
taskSchedulerEventHandlerForTest.taskAllocated(
    Mock for TaskAttempt, hashCode: 22892006,
    <any>,
    Container: [ContainerId: container_1_0001_01_000001, NodeId: randomHost:0, NodeHttpAddress:
randomHost:0, Resource: <memory:1024, vCores:1>, Priority: 3, Token: null, ]
);
-> at org.apache.tez.dag.app.rm.TestContainerReuse.testReuseNonLocalRequest(TestContainerReuse.java:454)

However, there were other interactions with this mock:
-> at org.apache.tez.dag.app.rm.TestContainerReuse.testReuseNonLocalRequest(TestContainerReuse.java:420)
-> at org.apache.tez.dag.app.rm.TestContainerReuse.testReuseNonLocalRequest(TestContainerReuse.java:420)
-> at org.apache.tez.dag.app.rm.TestContainerReuse.testReuseNonLocalRequest(TestContainerReuse.java:420)
-> at org.apache.tez.dag.app.rm.TestContainerReuse.testReuseNonLocalRequest(TestContainerReuse.java:421)
-> at org.apache.tez.dag.app.rm.TestContainerReuse.testReuseNonLocalRequest(TestContainerReuse.java:421)
-> at org.apache.tez.dag.app.rm.TestContainerReuse.testReuseNonLocalRequest(TestContainerReuse.java:421)
-> at org.apache.tez.dag.app.rm.TestContainerReuse.testReuseNonLocalRequest(TestContainerReuse.java:421)
-> at org.apache.tez.dag.app.rm.TestContainerReuse.testReuseNonLocalRequest(TestContainerReuse.java:423)
-> at org.apache.tez.dag.app.rm.TaskSchedulerAppCallbackWrapper$SetApplicationRegistrationDataCallable.call(TaskSchedulerAppCallbackWrapper.java:248)
-> at org.apache.tez.dag.app.rm.TestContainerReuse.testReuseNonLocalRequest(TestContainerReuse.java:448)


Tests run: 88, Failures: 1, Errors: 0, Skipped: 3

[INFO] ------------------------------------------------------------------------
[INFO] Reactor Summary:
[INFO] 
[INFO] tez ............................................... SUCCESS [3.292s]
[INFO] tez-dag-api ....................................... SUCCESS [19.890s]
[INFO] tez-common ........................................ SUCCESS [5.466s]
[INFO] tez-engine-api .................................... SUCCESS [3.636s]
[INFO] tez-engine ........................................ SUCCESS [7.103s]
[INFO] tez-mapreduce ..................................... SUCCESS [17.722s]
[INFO] tez-yarn-client ................................... SUCCESS [4.179s]
[INFO] tez-dag ........................................... FAILURE [23.559s]
[INFO] tez-mapreduce-examples ............................ SKIPPED
[INFO] tez-mapreduce-tests ............................... SKIPPED
[INFO] tez-dist .......................................... SKIPPED
[INFO] Tez ............................................... SKIPPED
[INFO] ------------------------------------------------------------------------
[INFO] BUILD FAILURE
[INFO] ------------------------------------------------------------------------
[INFO] Total time: 1:25.210s
[INFO] Finished at: Mon Aug 26 20:51:53 UTC 2013
[INFO] Final Memory: 113M/433M
[INFO] ------------------------------------------------------------------------
[ERROR] Failed to execute goal org.apache.maven.plugins:maven-surefire-plugin:2.14.1:test
(default-test) on project tez-dag: There are test failures.
[ERROR] 
[ERROR] Please refer to <https://builds.apache.org/job/Tez-Build/ws/tez-dag/target/surefire-reports>
for the individual test results.
[ERROR] -> [Help 1]
[ERROR] 
[ERROR] To see the full stack trace of the errors, re-run Maven with the -e switch.
[ERROR] Re-run Maven using the -X switch to enable full debug logging.
[ERROR] 
[ERROR] For more information about the errors and possible solutions, please read the following
articles:
[ERROR] [Help 1] http://cwiki.apache.org/confluence/display/MAVEN/MojoFailureException
[ERROR] 
[ERROR] After correcting the problems, you can resume the build with the command
[ERROR]   mvn <goals> -rf :tez-dag
Build step 'Execute shell' marked build as failure
Archiving artifacts
Recording test results

Mime
View raw message