tez-dev mailing list archives

Site index · List index
Message view « Date » · « Thread »
Top « Date » · « Thread »
From Apache Jenkins Server <jenk...@builds.apache.org>
Subject Build failed in Jenkins: Tez-Build #91
Date Thu, 01 Aug 2013 17:50:52 GMT
See <https://builds.apache.org/job/Tez-Build/91/changes>

Changes:

[sseth] TEZ-332. Change logs, stdout and stderr to be task specific instead of a

------------------------------------------
[...truncated 597 lines...]
[INFO] 
[INFO] --- maven-surefire-plugin:2.14.1:test (default-test) @ tez-engine ---
[INFO] No tests to run.
[INFO] 
[INFO] --- maven-resources-plugin:2.4.3:resources (default-resources) @ tez-engine ---
[WARNING] Using platform encoding (ISO-8859-1 actually) to copy filtered resources, i.e. build
is platform dependent!
[INFO] skip non existing resourceDirectory <https://builds.apache.org/job/Tez-Build/ws/tez-engine/src/main/resources>
[INFO] 
[INFO] --- maven-compiler-plugin:2.3.2:compile (default-compile) @ tez-engine ---
[INFO] Nothing to compile - all classes are up to date
[INFO] 
[INFO] --- maven-resources-plugin:2.4.3:testResources (default-testResources) @ tez-engine
---
[WARNING] Using platform encoding (ISO-8859-1 actually) to copy filtered resources, i.e. build
is platform dependent!
[INFO] skip non existing resourceDirectory <https://builds.apache.org/job/Tez-Build/ws/tez-engine/src/test/resources>
[INFO] 
[INFO] --- maven-compiler-plugin:2.3.2:testCompile (default-testCompile) @ tez-engine ---
[INFO] No sources to compile
[INFO] 
[INFO] --- maven-surefire-plugin:2.14.1:test (default-test) @ tez-engine ---
[INFO] No tests to run.
[INFO] Skipping execution of surefire because it has already been run for this configuration
[INFO] 
[INFO] --- maven-jar-plugin:2.3.1:jar (default-jar) @ tez-engine ---
[INFO] Building jar: <https://builds.apache.org/job/Tez-Build/ws/tez-engine/target/tez-engine-0.2.0-SNAPSHOT.jar>
[INFO] 
[INFO] --- maven-jar-plugin:2.3.1:test-jar (default) @ tez-engine ---
[WARNING] JAR will be empty - no content was marked for inclusion!
[INFO] Building jar: <https://builds.apache.org/job/Tez-Build/ws/tez-engine/target/tez-engine-0.2.0-SNAPSHOT-tests.jar>
[INFO] 
[INFO] --- maven-install-plugin:2.3.1:install (default-install) @ tez-engine ---
[INFO] Installing <https://builds.apache.org/job/Tez-Build/ws/tez-engine/target/tez-engine-0.2.0-SNAPSHOT.jar>
to /home/jenkins/.m2/repository/org/apache/tez/tez-engine/0.2.0-SNAPSHOT/tez-engine-0.2.0-SNAPSHOT.jar
[INFO] Installing <https://builds.apache.org/job/Tez-Build/ws/tez-engine/pom.xml> to
/home/jenkins/.m2/repository/org/apache/tez/tez-engine/0.2.0-SNAPSHOT/tez-engine-0.2.0-SNAPSHOT.pom
[INFO] Installing <https://builds.apache.org/job/Tez-Build/ws/tez-engine/target/tez-engine-0.2.0-SNAPSHOT-tests.jar>
to /home/jenkins/.m2/repository/org/apache/tez/tez-engine/0.2.0-SNAPSHOT/tez-engine-0.2.0-SNAPSHOT-tests.jar
[INFO] 
[INFO] --- maven-deploy-plugin:2.5:deploy (default-deploy) @ tez-engine ---
Downloading: https://repository.apache.org/content/repositories/snapshots/org/apache/tez/tez-engine/0.2.0-SNAPSHOT/maven-metadata.xml
990 B   
        
Downloaded: https://repository.apache.org/content/repositories/snapshots/org/apache/tez/tez-engine/0.2.0-SNAPSHOT/maven-metadata.xml
(990 B at 2.5 KB/sec)
Uploading: https://repository.apache.org/content/repositories/snapshots/org/apache/tez/tez-engine/0.2.0-SNAPSHOT/tez-engine-0.2.0-20130801.175033-51.jar
4 KB    
8 KB   
12 KB   
16 KB   
20 KB   
24 KB   
28 KB   
32 KB   
36 KB   
40 KB   
44 KB   
48 KB   
52 KB   
56 KB   
60 KB   
64 KB   
68 KB   
72 KB   
76 KB   
80 KB   
84 KB   
88 KB   
92 KB   
96 KB   
100 KB   
104 KB   
108 KB   
112 KB   
116 KB   
120 KB   
124 KB   
128 KB   
132 KB   
136 KB   
140 KB   
144 KB   
148 KB   
152 KB   
156 KB   
160 KB   
164 KB   
168 KB   
172 KB   
176 KB   
180 KB   
184 KB   
188 KB   
192 KB   
196 KB   
200 KB   
204 KB   
208 KB   
212 KB   
215 KB   
         
Uploaded: https://repository.apache.org/content/repositories/snapshots/org/apache/tez/tez-engine/0.2.0-SNAPSHOT/tez-engine-0.2.0-20130801.175033-51.jar
(215 KB at 418.5 KB/sec)
Uploading: https://repository.apache.org/content/repositories/snapshots/org/apache/tez/tez-engine/0.2.0-SNAPSHOT/tez-engine-0.2.0-20130801.175033-51.pom
2 KB     
       
Uploaded: https://repository.apache.org/content/repositories/snapshots/org/apache/tez/tez-engine/0.2.0-SNAPSHOT/tez-engine-0.2.0-20130801.175033-51.pom
(2 KB at 13.6 KB/sec)
Downloading: https://repository.apache.org/content/repositories/snapshots/org/apache/tez/tez-engine/maven-metadata.xml
284 B   
        
Downloaded: https://repository.apache.org/content/repositories/snapshots/org/apache/tez/tez-engine/maven-metadata.xml
(284 B at 0.5 KB/sec)
Uploading: https://repository.apache.org/content/repositories/snapshots/org/apache/tez/tez-engine/0.2.0-SNAPSHOT/maven-metadata.xml
990 B   
        
Uploaded: https://repository.apache.org/content/repositories/snapshots/org/apache/tez/tez-engine/0.2.0-SNAPSHOT/maven-metadata.xml
(990 B at 1.2 KB/sec)
Uploading: https://repository.apache.org/content/repositories/snapshots/org/apache/tez/tez-engine/maven-metadata.xml
284 B   
        
Uploaded: https://repository.apache.org/content/repositories/snapshots/org/apache/tez/tez-engine/maven-metadata.xml
(284 B at 1.9 KB/sec)
Uploading: https://repository.apache.org/content/repositories/snapshots/org/apache/tez/tez-engine/0.2.0-SNAPSHOT/tez-engine-0.2.0-20130801.175033-51-tests.jar
3 KB    
       
Uploaded: https://repository.apache.org/content/repositories/snapshots/org/apache/tez/tez-engine/0.2.0-SNAPSHOT/tez-engine-0.2.0-20130801.175033-51-tests.jar
(3 KB at 9.9 KB/sec)
Uploading: https://repository.apache.org/content/repositories/snapshots/org/apache/tez/tez-engine/0.2.0-SNAPSHOT/maven-metadata.xml
990 B   
        
Uploaded: https://repository.apache.org/content/repositories/snapshots/org/apache/tez/tez-engine/0.2.0-SNAPSHOT/maven-metadata.xml
(990 B at 5.9 KB/sec)
[INFO] 
[INFO] --- maven-resources-plugin:2.4.3:resources (default-resources) @ tez-engine ---
[WARNING] Using platform encoding (ISO-8859-1 actually) to copy filtered resources, i.e. build
is platform dependent!
[INFO] skip non existing resourceDirectory <https://builds.apache.org/job/Tez-Build/ws/tez-engine/src/main/resources>
[INFO] 
[INFO] --- maven-compiler-plugin:2.3.2:compile (default-compile) @ tez-engine ---
[INFO] Nothing to compile - all classes are up to date
[INFO] 
[INFO] --- maven-resources-plugin:2.4.3:testResources (default-testResources) @ tez-engine
---
[WARNING] Using platform encoding (ISO-8859-1 actually) to copy filtered resources, i.e. build
is platform dependent!
[INFO] skip non existing resourceDirectory <https://builds.apache.org/job/Tez-Build/ws/tez-engine/src/test/resources>
[INFO] 
[INFO] --- maven-compiler-plugin:2.3.2:testCompile (default-testCompile) @ tez-engine ---
[INFO] No sources to compile
[INFO] 
[INFO] --- maven-surefire-plugin:2.14.1:test (default-test) @ tez-engine ---
[INFO] No tests to run.
[INFO] Skipping execution of surefire because it has already been run for this configuration
[INFO] 
[INFO] --- maven-jar-plugin:2.3.1:jar (default-jar) @ tez-engine ---
[INFO] Building jar: <https://builds.apache.org/job/Tez-Build/ws/tez-engine/target/tez-engine-0.2.0-SNAPSHOT.jar>
[INFO] 
[INFO] --- maven-jar-plugin:2.3.1:test-jar (default) @ tez-engine ---
[WARNING] JAR will be empty - no content was marked for inclusion!
[INFO] Building jar: <https://builds.apache.org/job/Tez-Build/ws/tez-engine/target/tez-engine-0.2.0-SNAPSHOT-tests.jar>
[INFO]                                                                         
[INFO] ------------------------------------------------------------------------
[INFO] Building tez-mapreduce 0.2.0-SNAPSHOT
[INFO] ------------------------------------------------------------------------
[INFO] 
[INFO] --- maven-clean-plugin:2.4.1:clean (default-clean) @ tez-mapreduce ---
[INFO] Deleting <https://builds.apache.org/job/Tez-Build/ws/tez-mapreduce/target>
[INFO] 
[INFO] --- maven-resources-plugin:2.4.3:resources (default-resources) @ tez-mapreduce ---
[WARNING] Using platform encoding (ISO-8859-1 actually) to copy filtered resources, i.e. build
is platform dependent!
[INFO] skip non existing resourceDirectory <https://builds.apache.org/job/Tez-Build/ws/tez-mapreduce/src/main/resources>
[INFO] 
[INFO] --- maven-compiler-plugin:2.3.2:compile (default-compile) @ tez-mapreduce ---
[WARNING] File encoding has not been set, using platform encoding ISO-8859-1, i.e. build is
platform dependent!
[INFO] Compiling 35 source files to <https://builds.apache.org/job/Tez-Build/ws/tez-mapreduce/target/classes>
[INFO] 
[INFO] --- maven-resources-plugin:2.4.3:testResources (default-testResources) @ tez-mapreduce
---
[WARNING] Using platform encoding (ISO-8859-1 actually) to copy filtered resources, i.e. build
is platform dependent!
[INFO] Copying 1 resource
[INFO] 
[INFO] --- maven-compiler-plugin:2.3.2:testCompile (default-testCompile) @ tez-mapreduce ---
[WARNING] File encoding has not been set, using platform encoding ISO-8859-1, i.e. build is
platform dependent!
[INFO] Compiling 8 source files to <https://builds.apache.org/job/Tez-Build/ws/tez-mapreduce/target/test-classes>
[INFO] 
[INFO] --- maven-surefire-plugin:2.14.1:test (default-test) @ tez-mapreduce ---
[INFO] Surefire report directory: <https://builds.apache.org/job/Tez-Build/ws/tez-mapreduce/target/surefire-reports>

-------------------------------------------------------
 T E S T S
-------------------------------------------------------

-------------------------------------------------------
 T E S T S
-------------------------------------------------------
Running org.apache.tez.mapreduce.hadoop.TestConfigTranslationMRToTez
Tests run: 2, Failures: 0, Errors: 0, Skipped: 0, Time elapsed: 0.595 sec
Running org.apache.tez.mapreduce.hadoop.TestMRHelpers
Tests run: 10, Failures: 2, Errors: 0, Skipped: 0, Time elapsed: 4.143 sec <<< FAILURE!
testMapJavaOptions(org.apache.tez.mapreduce.hadoop.TestMRHelpers)  Time elapsed: 0.005 sec
 <<< FAILURE!
java.lang.AssertionError: null
	at org.junit.Assert.fail(Assert.java:86)
	at org.junit.Assert.assertTrue(Assert.java:41)
	at org.junit.Assert.assertTrue(Assert.java:52)
	at org.apache.tez.mapreduce.hadoop.TestMRHelpers.testMapJavaOptions(TestMRHelpers.java:274)

testReduceJavaOptions(org.apache.tez.mapreduce.hadoop.TestMRHelpers)  Time elapsed: 0 sec
 <<< FAILURE!
java.lang.AssertionError: null
	at org.junit.Assert.fail(Assert.java:86)
	at org.junit.Assert.assertTrue(Assert.java:41)
	at org.junit.Assert.assertTrue(Assert.java:52)
	at org.apache.tez.mapreduce.hadoop.TestMRHelpers.testReduceJavaOptions(TestMRHelpers.java:290)

Running org.apache.tez.mapreduce.hadoop.TestDeprecatedKeys
Tests run: 1, Failures: 0, Errors: 0, Skipped: 0, Time elapsed: 0.347 sec
Running org.apache.tez.mapreduce.processor.reduce.TestReduceProcessor
Tests run: 1, Failures: 0, Errors: 0, Skipped: 0, Time elapsed: 1.274 sec
Running org.apache.tez.mapreduce.processor.map.TestMapProcessor
Tests run: 2, Failures: 0, Errors: 0, Skipped: 1, Time elapsed: 1.206 sec

Results :

Failed tests: 
  TestMRHelpers.testMapJavaOptions:274 null
  TestMRHelpers.testReduceJavaOptions:290 null

Tests run: 16, Failures: 2, Errors: 0, Skipped: 1

[INFO] ------------------------------------------------------------------------
[INFO] Reactor Summary:
[INFO] 
[INFO] tez ............................................... SUCCESS [6.109s]
[INFO] tez-dag-api ....................................... SUCCESS [17.882s]
[INFO] tez-common ........................................ SUCCESS [5.290s]
[INFO] tez-engine-api .................................... SUCCESS [4.030s]
[INFO] tez-engine ........................................ SUCCESS [6.006s]
[INFO] tez-mapreduce ..................................... FAILURE [12.158s]
[INFO] tez-yarn-client ................................... SKIPPED
[INFO] tez-dag ........................................... SKIPPED
[INFO] tez-mapreduce-examples ............................ SKIPPED
[INFO] tez-mapreduce-tests ............................... SKIPPED
[INFO] tez-dist .......................................... SKIPPED
[INFO] ------------------------------------------------------------------------
[INFO] BUILD FAILURE
[INFO] ------------------------------------------------------------------------
[INFO] Total time: 51.786s
[INFO] Finished at: Thu Aug 01 17:50:48 UTC 2013
[INFO] Final Memory: 74M/485M
[INFO] ------------------------------------------------------------------------
[ERROR] Failed to execute goal org.apache.maven.plugins:maven-surefire-plugin:2.14.1:test
(default-test) on project tez-mapreduce: There are test failures.
[ERROR] 
[ERROR] Please refer to <https://builds.apache.org/job/Tez-Build/ws/tez-mapreduce/target/surefire-reports>
for the individual test results.
[ERROR] -> [Help 1]
[ERROR] 
[ERROR] To see the full stack trace of the errors, re-run Maven with the -e switch.
[ERROR] Re-run Maven using the -X switch to enable full debug logging.
[ERROR] 
[ERROR] For more information about the errors and possible solutions, please read the following
articles:
[ERROR] [Help 1] http://cwiki.apache.org/confluence/display/MAVEN/MojoFailureException
[ERROR] 
[ERROR] After correcting the problems, you can resume the build with the command
[ERROR]   mvn <goals> -rf :tez-mapreduce
Build step 'Execute shell' marked build as failure
Archiving artifacts
Recording test results

Mime
View raw message