tez-dev mailing list archives

Site index · List index
Message view « Date » · « Thread »
Top « Date » · « Thread »
From Apache Jenkins Server <jenk...@builds.apache.org>
Subject Build failed in Jenkins: Tez-Build #100
Date Fri, 16 Aug 2013 02:40:21 GMT
See <https://builds.apache.org/job/Tez-Build/100/changes>

Changes:

[sseth] TEZ-363. Move to protobuf 2.5.0. Contributed by Hitesh Shah.

------------------------------------------
[...truncated 6578 lines...]
[INFO] --- maven-compiler-plugin:2.3.2:testCompile (default-testCompile) @ tez-mapreduce-tests
---
[WARNING] File encoding has not been set, using platform encoding ISO-8859-1, i.e. build is
platform dependent!
[INFO] Compiling 3 source files to <https://builds.apache.org/job/Tez-Build/ws/tez-mapreduce-tests/target/test-classes>
[INFO] 
[INFO] --- maven-surefire-plugin:2.14.1:test (default-test) @ tez-mapreduce-tests ---
[INFO] Surefire report directory: <https://builds.apache.org/job/Tez-Build/ws/tez-mapreduce-tests/target/surefire-reports>

-------------------------------------------------------
 T E S T S
-------------------------------------------------------

-------------------------------------------------------
 T E S T S
-------------------------------------------------------
Running org.apache.tez.mapreduce.TestMRRJobs
Tests run: 5, Failures: 0, Errors: 0, Skipped: 0, Time elapsed: 120.425 sec
Running org.apache.tez.mapreduce.TestMRRJobsDAGApi
Tests run: 2, Failures: 0, Errors: 0, Skipped: 0, Time elapsed: 45.766 sec

Results :

Tests run: 7, Failures: 0, Errors: 0, Skipped: 0

[INFO] 
[INFO] --- maven-resources-plugin:2.4.3:resources (default-resources) @ tez-mapreduce-tests
---
[WARNING] Using platform encoding (ISO-8859-1 actually) to copy filtered resources, i.e. build
is platform dependent!
[INFO] skip non existing resourceDirectory <https://builds.apache.org/job/Tez-Build/ws/tez-mapreduce-tests/src/main/resources>
[INFO] 
[INFO] --- maven-compiler-plugin:2.3.2:compile (default-compile) @ tez-mapreduce-tests ---
[INFO] No sources to compile
[INFO] 
[INFO] --- maven-resources-plugin:2.4.3:testResources (default-testResources) @ tez-mapreduce-tests
---
[WARNING] Using platform encoding (ISO-8859-1 actually) to copy filtered resources, i.e. build
is platform dependent!
[INFO] skip non existing resourceDirectory <https://builds.apache.org/job/Tez-Build/ws/tez-mapreduce-tests/src/test/resources>
[INFO] 
[INFO] --- maven-compiler-plugin:2.3.2:testCompile (default-testCompile) @ tez-mapreduce-tests
---
[INFO] Nothing to compile - all classes are up to date
[INFO] 
[INFO] --- maven-surefire-plugin:2.14.1:test (default-test) @ tez-mapreduce-tests ---
[INFO] Skipping execution of surefire because it has already been run for this configuration
[INFO] 
[INFO] --- maven-jar-plugin:2.3.1:jar (default-jar) @ tez-mapreduce-tests ---
[WARNING] JAR will be empty - no content was marked for inclusion!
[INFO] Building jar: <https://builds.apache.org/job/Tez-Build/ws/tez-mapreduce-tests/target/tez-mapreduce-tests-0.2.0-SNAPSHOT.jar>
[INFO] 
[INFO] --- maven-jar-plugin:2.3.1:test-jar (default) @ tez-mapreduce-tests ---
[INFO] Building jar: <https://builds.apache.org/job/Tez-Build/ws/tez-mapreduce-tests/target/tez-mapreduce-tests-0.2.0-SNAPSHOT-tests.jar>
[INFO] 
[INFO] --- maven-install-plugin:2.3.1:install (default-install) @ tez-mapreduce-tests ---
[INFO] Installing <https://builds.apache.org/job/Tez-Build/ws/tez-mapreduce-tests/target/tez-mapreduce-tests-0.2.0-SNAPSHOT.jar>
to /home/jenkins/.m2/repository/org/apache/tez/tez-mapreduce-tests/0.2.0-SNAPSHOT/tez-mapreduce-tests-0.2.0-SNAPSHOT.jar
[INFO] Installing <https://builds.apache.org/job/Tez-Build/ws/tez-mapreduce-tests/pom.xml>
to /home/jenkins/.m2/repository/org/apache/tez/tez-mapreduce-tests/0.2.0-SNAPSHOT/tez-mapreduce-tests-0.2.0-SNAPSHOT.pom
[INFO] Installing <https://builds.apache.org/job/Tez-Build/ws/tez-mapreduce-tests/target/tez-mapreduce-tests-0.2.0-SNAPSHOT-tests.jar>
to /home/jenkins/.m2/repository/org/apache/tez/tez-mapreduce-tests/0.2.0-SNAPSHOT/tez-mapreduce-tests-0.2.0-SNAPSHOT-tests.jar
[INFO] 
[INFO] --- maven-deploy-plugin:2.5:deploy (default-deploy) @ tez-mapreduce-tests ---
Downloading: https://repository.apache.org/content/repositories/snapshots/org/apache/tez/tez-mapreduce-tests/0.2.0-SNAPSHOT/maven-metadata.xml
999 B    
        
Downloaded: https://repository.apache.org/content/repositories/snapshots/org/apache/tez/tez-mapreduce-tests/0.2.0-SNAPSHOT/maven-metadata.xml
(999 B at 1.6 KB/sec)
Uploading: https://repository.apache.org/content/repositories/snapshots/org/apache/tez/tez-mapreduce-tests/0.2.0-SNAPSHOT/tez-mapreduce-tests-0.2.0-20130816.023958-13.jar
3 KB    
       
Uploaded: https://repository.apache.org/content/repositories/snapshots/org/apache/tez/tez-mapreduce-tests/0.2.0-SNAPSHOT/tez-mapreduce-tests-0.2.0-20130816.023958-13.jar
(3 KB at 8.4 KB/sec)
Uploading: https://repository.apache.org/content/repositories/snapshots/org/apache/tez/tez-mapreduce-tests/0.2.0-SNAPSHOT/tez-mapreduce-tests-0.2.0-20130816.023958-13.pom
4 KB   
       
Uploaded: https://repository.apache.org/content/repositories/snapshots/org/apache/tez/tez-mapreduce-tests/0.2.0-SNAPSHOT/tez-mapreduce-tests-0.2.0-20130816.023958-13.pom
(4 KB at 21.8 KB/sec)
Downloading: https://repository.apache.org/content/repositories/snapshots/org/apache/tez/tez-mapreduce-tests/maven-metadata.xml
293 B   
        
Downloaded: https://repository.apache.org/content/repositories/snapshots/org/apache/tez/tez-mapreduce-tests/maven-metadata.xml
(293 B at 0.8 KB/sec)
Uploading: https://repository.apache.org/content/repositories/snapshots/org/apache/tez/tez-mapreduce-tests/0.2.0-SNAPSHOT/maven-metadata.xml
999 B   
        
Uploaded: https://repository.apache.org/content/repositories/snapshots/org/apache/tez/tez-mapreduce-tests/0.2.0-SNAPSHOT/maven-metadata.xml
(999 B at 1.4 KB/sec)
Uploading: https://repository.apache.org/content/repositories/snapshots/org/apache/tez/tez-mapreduce-tests/maven-metadata.xml
293 B   
        
Uploaded: https://repository.apache.org/content/repositories/snapshots/org/apache/tez/tez-mapreduce-tests/maven-metadata.xml
(293 B at 1.1 KB/sec)
Uploading: https://repository.apache.org/content/repositories/snapshots/org/apache/tez/tez-mapreduce-tests/0.2.0-SNAPSHOT/tez-mapreduce-tests-0.2.0-20130816.023958-13-tests.jar
4 KB    
8 KB   
12 KB   
16 KB   
17 KB   
        
Uploaded: https://repository.apache.org/content/repositories/snapshots/org/apache/tez/tez-mapreduce-tests/0.2.0-SNAPSHOT/tez-mapreduce-tests-0.2.0-20130816.023958-13-tests.jar
(17 KB at 85.3 KB/sec)
Uploading: https://repository.apache.org/content/repositories/snapshots/org/apache/tez/tez-mapreduce-tests/0.2.0-SNAPSHOT/maven-metadata.xml
999 B   
        
Uploaded: https://repository.apache.org/content/repositories/snapshots/org/apache/tez/tez-mapreduce-tests/0.2.0-SNAPSHOT/maven-metadata.xml
(999 B at 6.3 KB/sec)
[INFO] 
[INFO] --- maven-resources-plugin:2.4.3:resources (default-resources) @ tez-mapreduce-tests
---
[WARNING] Using platform encoding (ISO-8859-1 actually) to copy filtered resources, i.e. build
is platform dependent!
[INFO] skip non existing resourceDirectory <https://builds.apache.org/job/Tez-Build/ws/tez-mapreduce-tests/src/main/resources>
[INFO] 
[INFO] --- maven-compiler-plugin:2.3.2:compile (default-compile) @ tez-mapreduce-tests ---
[INFO] No sources to compile
[INFO] 
[INFO] --- maven-resources-plugin:2.4.3:testResources (default-testResources) @ tez-mapreduce-tests
---
[WARNING] Using platform encoding (ISO-8859-1 actually) to copy filtered resources, i.e. build
is platform dependent!
[INFO] skip non existing resourceDirectory <https://builds.apache.org/job/Tez-Build/ws/tez-mapreduce-tests/src/test/resources>
[INFO] 
[INFO] --- maven-compiler-plugin:2.3.2:testCompile (default-testCompile) @ tez-mapreduce-tests
---
[INFO] Nothing to compile - all classes are up to date
[INFO] 
[INFO] --- maven-surefire-plugin:2.14.1:test (default-test) @ tez-mapreduce-tests ---
[INFO] Skipping execution of surefire because it has already been run for this configuration
[INFO] 
[INFO] --- maven-jar-plugin:2.3.1:jar (default-jar) @ tez-mapreduce-tests ---
[WARNING] JAR will be empty - no content was marked for inclusion!
[INFO] Building jar: <https://builds.apache.org/job/Tez-Build/ws/tez-mapreduce-tests/target/tez-mapreduce-tests-0.2.0-SNAPSHOT.jar>
[INFO] 
[INFO] --- maven-jar-plugin:2.3.1:test-jar (default) @ tez-mapreduce-tests ---
[INFO] Building jar: <https://builds.apache.org/job/Tez-Build/ws/tez-mapreduce-tests/target/tez-mapreduce-tests-0.2.0-SNAPSHOT-tests.jar>
[INFO]                                                                         
[INFO] ------------------------------------------------------------------------
[INFO] Building tez-dist 0.2.0-SNAPSHOT
[INFO] ------------------------------------------------------------------------
[INFO] 
[INFO] --- maven-clean-plugin:2.4.1:clean (default-clean) @ tez-dist ---
[INFO] 
[INFO] --- maven-assembly-plugin:2.4:single (package-tez-full) @ tez-dist ---
[INFO] Reading assembly descriptor: src/main/assembly/tez-dist-full.xml
Downloading: https://repository.apache.org/content/repositories/snapshots/org/apache/hadoop/hadoop-project/3.0.0-SNAPSHOT/maven-metadata.xml
828 B   
        
Downloaded: https://repository.apache.org/content/repositories/snapshots/org/apache/hadoop/hadoop-project/3.0.0-SNAPSHOT/maven-metadata.xml
(828 B at 1.9 KB/sec)
Downloading: https://repository.apache.org/content/repositories/snapshots/org/apache/hadoop/hadoop-project/3.0.0-SNAPSHOT/hadoop-project-3.0.0-20130815.233849-2324.pom
781 B   
3 KB    
7 KB   
8 KB   
12 KB   
15 KB   
19 KB   
20 KB   
24 KB   
25 KB   
28 KB   
30 KB   
33 KB   
34 KB   
        
Downloaded: https://repository.apache.org/content/repositories/snapshots/org/apache/hadoop/hadoop-project/3.0.0-SNAPSHOT/hadoop-project-3.0.0-20130815.233849-2324.pom
(34 KB at 43.4 KB/sec)
Downloading: https://repository.apache.org/content/repositories/snapshots/org/apache/hadoop/hadoop-main/3.0.0-SNAPSHOT/maven-metadata.xml
611 B   
        
Downloaded: https://repository.apache.org/content/repositories/snapshots/org/apache/hadoop/hadoop-main/3.0.0-SNAPSHOT/maven-metadata.xml
(611 B at 1.8 KB/sec)
Downloading: https://repository.apache.org/content/repositories/snapshots/org/apache/hadoop/hadoop-main/3.0.0-SNAPSHOT/hadoop-main-3.0.0-20130815.233843-2324.pom
818 B   
3 KB    
6 KB   
10 KB   
11 KB   
14 KB   
17 KB   
19 KB   
21 KB   
        
Downloaded: https://repository.apache.org/content/repositories/snapshots/org/apache/hadoop/hadoop-main/3.0.0-SNAPSHOT/hadoop-main-3.0.0-20130815.233843-2324.pom
(21 KB at 48.2 KB/sec)
[WARNING] NOTE: Currently, inclusion of module dependencies may produce unpredictable results
if a version conflict occurs.
[INFO] Building tar: <https://builds.apache.org/job/Tez-Build/100/artifact/tez-dist/target/tez-0.2.0-SNAPSHOT-full.tar.gz>
[INFO] 
[INFO] --- maven-assembly-plugin:2.4:single (package-tez) @ tez-dist ---
[INFO] Reading assembly descriptor: src/main/assembly/tez-dist.xml
[WARNING] NOTE: Currently, inclusion of module dependencies may produce unpredictable results
if a version conflict occurs.
[INFO] Building tar: <https://builds.apache.org/job/Tez-Build/100/artifact/tez-dist/target/tez-0.2.0-SNAPSHOT.tar.gz>
[INFO] 
[INFO] --- maven-install-plugin:2.3.1:install (default-install) @ tez-dist ---
[INFO] Installing <https://builds.apache.org/job/Tez-Build/ws/tez-dist/pom.xml> to /home/jenkins/.m2/repository/org/apache/tez/tez-dist/0.2.0-SNAPSHOT/tez-dist-0.2.0-SNAPSHOT.pom
[INFO] 
[INFO] --- maven-deploy-plugin:2.5:deploy (default-deploy) @ tez-dist ---
Downloading: https://repository.apache.org/content/repositories/snapshots/org/apache/tez/tez-dist/0.2.0-SNAPSHOT/maven-metadata.xml
601 B   
        
Downloaded: https://repository.apache.org/content/repositories/snapshots/org/apache/tez/tez-dist/0.2.0-SNAPSHOT/maven-metadata.xml
(601 B at 0.6 KB/sec)
Uploading: https://repository.apache.org/content/repositories/snapshots/org/apache/tez/tez-dist/0.2.0-SNAPSHOT/tez-dist-0.2.0-20130816.024009-13.pom
4 KB    
5 KB   
       
Uploaded: https://repository.apache.org/content/repositories/snapshots/org/apache/tez/tez-dist/0.2.0-SNAPSHOT/tez-dist-0.2.0-20130816.024009-13.pom
(5 KB at 8.7 KB/sec)
Downloading: https://repository.apache.org/content/repositories/snapshots/org/apache/tez/tez-dist/maven-metadata.xml
282 B   
        
Downloaded: https://repository.apache.org/content/repositories/snapshots/org/apache/tez/tez-dist/maven-metadata.xml
(282 B at 1.0 KB/sec)
Uploading: https://repository.apache.org/content/repositories/snapshots/org/apache/tez/tez-dist/0.2.0-SNAPSHOT/maven-metadata.xml
601 B   
        
Uploaded: https://repository.apache.org/content/repositories/snapshots/org/apache/tez/tez-dist/0.2.0-SNAPSHOT/maven-metadata.xml
(601 B at 1.7 KB/sec)
Uploading: https://repository.apache.org/content/repositories/snapshots/org/apache/tez/tez-dist/maven-metadata.xml
282 B   
        
Uploaded: https://repository.apache.org/content/repositories/snapshots/org/apache/tez/tez-dist/maven-metadata.xml
(282 B at 1.5 KB/sec)
[INFO] 
[INFO] --- maven-assembly-plugin:2.4:single (package-tez-full) @ tez-dist ---
[INFO] Reading assembly descriptor: src/main/assembly/tez-dist-full.xml
[WARNING] NOTE: Currently, inclusion of module dependencies may produce unpredictable results
if a version conflict occurs.
[INFO] Building tar: <https://builds.apache.org/job/Tez-Build/100/artifact/tez-dist/target/tez-0.2.0-SNAPSHOT-full.tar.gz>
[INFO] 
[INFO] --- maven-assembly-plugin:2.4:single (package-tez) @ tez-dist ---
[INFO] Reading assembly descriptor: src/main/assembly/tez-dist.xml
[WARNING] NOTE: Currently, inclusion of module dependencies may produce unpredictable results
if a version conflict occurs.
[INFO] Building tar: <https://builds.apache.org/job/Tez-Build/100/artifact/tez-dist/target/tez-0.2.0-SNAPSHOT.tar.gz>
[INFO]                                                                         
[INFO] ------------------------------------------------------------------------
[INFO] Building Tez 0.2.0-SNAPSHOT
[INFO] ------------------------------------------------------------------------
[INFO] 
[INFO] --- maven-clean-plugin:2.4.1:clean (default-clean) @ tez-docs ---
[INFO] 
[INFO] --- maven-install-plugin:2.3.1:install (default-install) @ tez-docs ---
[INFO] Installing <https://builds.apache.org/job/Tez-Build/ws/docs/pom.xml> to /home/jenkins/.m2/repository/org/apache/tez/tez-docs/0.2.0-SNAPSHOT/tez-docs-0.2.0-SNAPSHOT.pom
[INFO] 
[INFO] --- maven-deploy-plugin:2.5:deploy (default-deploy) @ tez-docs ---
[INFO] ------------------------------------------------------------------------
[INFO] Reactor Summary:
[INFO] 
[INFO] tez ............................................... SUCCESS [2.889s]
[INFO] tez-dag-api ....................................... SUCCESS [29.564s]
[INFO] tez-common ........................................ SUCCESS [5.074s]
[INFO] tez-engine-api .................................... SUCCESS [2.704s]
[INFO] tez-engine ........................................ SUCCESS [4.986s]
[INFO] tez-mapreduce ..................................... SUCCESS [40.634s]
[INFO] tez-yarn-client ................................... SUCCESS [3.818s]
[INFO] tez-dag ........................................... SUCCESS [25.190s]
[INFO] tez-mapreduce-examples ............................ SUCCESS [7.098s]
[INFO] tez-mapreduce-tests ............................... SUCCESS [2:52.218s]
[INFO] tez-dist .......................................... SUCCESS [13.813s]
[INFO] Tez ............................................... FAILURE [0.076s]
[INFO] ------------------------------------------------------------------------
[INFO] BUILD FAILURE
[INFO] ------------------------------------------------------------------------
[INFO] Total time: 5:08.468s
[INFO] Finished at: Fri Aug 16 02:40:14 UTC 2013
[INFO] Final Memory: 125M/509M
[INFO] ------------------------------------------------------------------------
[ERROR] Failed to execute goal org.apache.maven.plugins:maven-deploy-plugin:2.5:deploy (default-deploy)
on project tez-docs: Deployment failed: repository element was not specified in the POM inside
distributionManagement element or in -DaltDeploymentRepository=id::layout::url parameter ->
[Help 1]
[ERROR] 
[ERROR] To see the full stack trace of the errors, re-run Maven with the -e switch.
[ERROR] Re-run Maven using the -X switch to enable full debug logging.
[ERROR] 
[ERROR] For more information about the errors and possible solutions, please read the following
articles:
[ERROR] [Help 1] http://cwiki.apache.org/confluence/display/MAVEN/MojoExecutionException
[ERROR] 
[ERROR] After correcting the problems, you can resume the build with the command
[ERROR]   mvn <goals> -rf :tez-docs
Build step 'Execute shell' marked build as failure
Archiving artifacts
Recording test results

Mime
View raw message