tez-dev mailing list archives

Site index · List index
Message view « Date » · « Thread »
Top « Date » · « Thread »
From Apache Jenkins Server <jenk...@builds.apache.org>
Subject Build failed in Jenkins: Tez-Build #97
Date Tue, 13 Aug 2013 04:51:14 GMT
See <https://builds.apache.org/job/Tez-Build/97/changes>

Changes:

[sseth] TEZ-334. Remove some redundant variables from

------------------------------------------
[...truncated 1389 lines...]
815 KB   2292 KB   
815 KB   2296 KB   
815 KB   2300 KB   
815 KB   2304 KB   
815 KB   2304 KB   
815 KB   2308 KB   
815 KB   2312 KB   
815 KB   2316 KB   
815 KB   2320 KB   
815 KB   2324 KB   
815 KB   2328 KB   
815 KB   2332 KB   
815 KB   2336 KB   
815 KB   2340 KB   
815 KB   2344 KB   
815 KB   2348 KB   
815 KB   2352 KB   
819 KB   2352 KB   
823 KB   2352 KB   
823 KB   2356 KB   
827 KB   2356 KB   
831 KB   2356 KB   
835 KB   2356 KB   
835 KB   2360 KB   
838 KB   2360 KB   
842 KB   2360 KB   
842 KB   2364 KB   
846 KB   2364 KB   
846 KB   2368 KB   
850 KB   2368 KB   
854 KB   2368 KB   
854 KB   2372 KB   
858 KB   2372 KB   
862 KB   2372 KB   
862 KB   2372 KB   
862 KB   2376 KB   
866 KB   2376 KB   
870 KB   2376 KB   
870 KB   2380 KB   
874 KB   2380 KB   
877 KB   2380 KB   
877 KB   2384 KB   
877 KB   2388 KB   
877 KB   2392 KB   
877 KB   2392 KB   
877 KB   2396 KB   
877 KB   2400 KB   
877 KB   2404 KB   
877 KB   2408 KB   
877 KB   2412 KB   
877 KB   2416 KB   
877 KB   2420 KB   
877 KB   2424 KB   
877 KB   2428 KB   
877 KB   2432 KB   
877 KB   2436 KB   
877 KB   2440 KB   
877 KB   2444 KB   
877 KB   2448 KB   
877 KB   2452 KB   
877 KB   2456 KB   
877 KB   2460 KB   
877 KB   2464 KB   
877 KB   2468 KB   
877 KB   2472 KB   
877 KB   2476 KB   
877 KB   2480 KB   
877 KB   2484 KB   
877 KB   2488 KB   
877 KB   2492 KB   
877 KB   2495 KB   
877 KB   2496 KB   
877 KB   2500 KB   
877 KB   2504 KB   
877 KB   2508 KB   
877 KB   2508 KB   
877 KB   2512 KB   
877 KB   2516 KB   
877 KB   2520 KB   
877 KB   2524 KB   
877 KB   2528 KB   
877 KB   2532 KB   
877 KB   2536 KB   
877 KB   2540 KB   
877 KB   2544 KB   
877 KB   2548 KB   
877 KB   2552 KB   
877 KB   2555 KB   
877 KB   2559 KB   
877 KB   2563 KB   
877 KB   2567 KB   
877 KB   2571 KB   
877 KB   2575 KB   
877 KB   2579 KB   
877 KB   2583 KB   
877 KB   2587 KB   
877 KB   2591 KB   
877 KB   2594 KB   
877 KB   2598 KB   
877 KB   2602 KB   
877 KB   2606 KB   
877 KB   2610 KB   
877 KB   2614 KB   
877 KB   2618 KB   
877 KB   2622 KB   
877 KB   2623 KB   
881 KB   2623 KB   
885 KB   2623 KB   
889 KB   2623 KB   
893 KB   2623 KB   
897 KB   2623 KB   
901 KB   2623 KB   
905 KB   2623 KB   
909 KB   2623 KB   
913 KB   2623 KB   
917 KB   2623 KB   
921 KB   2623 KB   
924 KB   2623 KB   
928 KB   2623 KB   
932 KB   2623 KB   
936 KB   2623 KB   
940 KB   2623 KB   
944 KB   2623 KB   
948 KB   2623 KB   
952 KB   2623 KB   
956 KB   2623 KB   
960 KB   2623 KB   
963 KB   2623 KB   
967 KB   2623 KB   
971 KB   2623 KB   
975 KB   2623 KB   
979 KB   2623 KB   
983 KB   2623 KB   
987 KB   2623 KB   
991 KB   2623 KB   
995 KB   2623 KB   
999 KB   2623 KB   
1002 KB   2623 KB   
1006 KB   2623 KB   
1010 KB   2623 KB   
1014 KB   2623 KB   
1018 KB   2623 KB   
1022 KB   2623 KB   
1026 KB   2623 KB   
1030 KB   2623 KB   
1034 KB   2623 KB   
1038 KB   2623 KB   
1042 KB   2623 KB   
1046 KB   2623 KB   
1049 KB   2623 KB   
1053 KB   2623 KB   
1057 KB   2623 KB   
1061 KB   2623 KB   
1065 KB   2623 KB   
1069 KB   2623 KB   
1073 KB   2623 KB   
1077 KB   2623 KB   
1081 KB   2623 KB   
1085 KB   2623 KB   
1088 KB   2623 KB   
1092 KB   2623 KB   
1096 KB   2623 KB   
1100 KB   2623 KB   
1104 KB   2623 KB   
1108 KB   2623 KB   
1112 KB   2623 KB   
1116 KB   2623 KB   
1120 KB   2623 KB   
1124 KB   2623 KB   
1127 KB   2623 KB   
1131 KB   2623 KB   
1135 KB   2623 KB   
1139 KB   2623 KB   
1143 KB   2623 KB   
1147 KB   2623 KB   
1151 KB   2623 KB   
1155 KB   2623 KB   
1159 KB   2623 KB   
1163 KB   2623 KB   
1167 KB   2623 KB   
1171 KB   2623 KB   
1174 KB   2623 KB   
1178 KB   2623 KB   
1182 KB   2623 KB   
1186 KB   2623 KB   
1188 KB   2623 KB   
1192 KB   2623 KB   
1196 KB   2623 KB   
1200 KB   2623 KB   
1204 KB   2623 KB   
1208 KB   2623 KB   
1212 KB   2623 KB   
1216 KB   2623 KB   
1220 KB   2623 KB   
1224 KB   2623 KB   
1228 KB   2623 KB   
1232 KB   2623 KB   
1235 KB   2623 KB   
1239 KB   2623 KB   
1243 KB   2623 KB   
1247 KB   2623 KB   
1251 KB   2623 KB   
1255 KB   2623 KB   
1259 KB   2623 KB   
1263 KB   2623 KB   
1266 KB   2623 KB   
                    
Downloaded: https://repository.apache.org/content/repositories/snapshots/org/apache/hadoop/hadoop-common/3.0.0-SNAPSHOT/hadoop-common-3.0.0-20130813.003352-3203.jar
(2623 KB at 2772.4 KB/sec)
                    
Downloaded: https://repository.apache.org/content/repositories/snapshots/org/apache/hadoop/hadoop-yarn-common/3.0.0-SNAPSHOT/hadoop-yarn-common-3.0.0-20130813.003517-2721.jar
(1266 KB at 1692.2 KB/sec)
[INFO] 
[INFO] --- maven-clean-plugin:2.4.1:clean (default-clean) @ tez-dag-api ---
[INFO] Deleting <https://builds.apache.org/job/Tez-Build/ws/tez-dag-api/target>
[INFO] 
[INFO] --- hadoop-maven-plugins:3.0.0-SNAPSHOT:protoc (compile-protoc) @ tez-dag-api ---
[INFO] ------------------------------------------------------------------------
[INFO] Reactor Summary:
[INFO] 
[INFO] tez ............................................... SUCCESS [4.866s]
[INFO] tez-dag-api ....................................... FAILURE [12.154s]
[INFO] tez-common ........................................ SKIPPED
[INFO] tez-engine-api .................................... SKIPPED
[INFO] tez-engine ........................................ SKIPPED
[INFO] tez-mapreduce ..................................... SKIPPED
[INFO] tez-yarn-client ................................... SKIPPED
[INFO] tez-dag ........................................... SKIPPED
[INFO] tez-mapreduce-examples ............................ SKIPPED
[INFO] tez-mapreduce-tests ............................... SKIPPED
[INFO] tez-dist .......................................... SKIPPED
[INFO] ------------------------------------------------------------------------
[INFO] BUILD FAILURE
[INFO] ------------------------------------------------------------------------
[INFO] Total time: 17.522s
[INFO] Finished at: Tue Aug 13 04:51:11 UTC 2013
[INFO] Final Memory: 9M/61M
[INFO] ------------------------------------------------------------------------
[ERROR] Failed to execute goal org.apache.hadoop:hadoop-maven-plugins:3.0.0-SNAPSHOT:protoc
(compile-protoc) on project tez-dag-api: The parameters 'protocVersion' for goal org.apache.hadoop:hadoop-maven-plugins:3.0.0-SNAPSHOT:protoc
are missing or invalid -> [Help 1]
[ERROR] 
[ERROR] To see the full stack trace of the errors, re-run Maven with the -e switch.
[ERROR] Re-run Maven using the -X switch to enable full debug logging.
[ERROR] 
[ERROR] For more information about the errors and possible solutions, please read the following
articles:
[ERROR] [Help 1] http://cwiki.apache.org/confluence/display/MAVEN/PluginParameterException
[ERROR] 
[ERROR] After correcting the problems, you can resume the build with the command
[ERROR]   mvn <goals> -rf :tez-dag-api
Build step 'Execute shell' marked build as failure
Archiving artifacts
Recording test results

Mime
View raw message