tez-dev mailing list archives

Site index · List index
Message view « Date » · « Thread »
Top « Date » · « Thread »
From Apache Jenkins Server <jenk...@builds.apache.org>
Subject Build failed in Jenkins: Tez-Build #162
Date Tue, 15 Oct 2013 07:53:24 GMT
See <https://builds.apache.org/job/Tez-Build/162/changes>

Changes:

[sseth] TEZ-561. Change MRHelper byte helpers to use compression. (sseth)

------------------------------------------
[...truncated 5805 lines...]
4615/5148 KB   
4619/5148 KB   
4623/5148 KB   
4627/5148 KB   
4631/5148 KB   
4635/5148 KB   
4639/5148 KB   
4643/5148 KB   
4647/5148 KB   
4651/5148 KB   
4655/5148 KB   
4659/5148 KB   
4662/5148 KB   
4666/5148 KB   
4670/5148 KB   
4674/5148 KB   
4678/5148 KB   
4682/5148 KB   
4686/5148 KB   
4690/5148 KB   
4694/5148 KB   
4698/5148 KB   
4701/5148 KB   
4705/5148 KB   
4709/5148 KB   
4713/5148 KB   
4717/5148 KB   
4721/5148 KB   
4725/5148 KB   
4729/5148 KB   
4733/5148 KB   
4737/5148 KB   
4740/5148 KB   
4744/5148 KB   
4748/5148 KB   
4752/5148 KB   
4756/5148 KB   
4760/5148 KB   
4764/5148 KB   
4768/5148 KB   
4772/5148 KB   
4776/5148 KB   
4780/5148 KB   
4784/5148 KB   
4787/5148 KB   
4791/5148 KB   
4795/5148 KB   
4799/5148 KB   
4803/5148 KB   
4807/5148 KB   
4811/5148 KB   
4815/5148 KB   
4819/5148 KB   
4823/5148 KB   
4826/5148 KB   
4830/5148 KB   
4834/5148 KB   
4838/5148 KB   
4842/5148 KB   
4846/5148 KB   
4850/5148 KB   
4854/5148 KB   
4858/5148 KB   
4862/5148 KB   
4865/5148 KB   
4869/5148 KB   
4873/5148 KB   
4877/5148 KB   
4881/5148 KB   
4885/5148 KB   
4889/5148 KB   
4893/5148 KB   
4897/5148 KB   
4901/5148 KB   
4905/5148 KB   
4909/5148 KB   
4912/5148 KB   
4916/5148 KB   
4920/5148 KB   
4924/5148 KB   
4928/5148 KB   
4932/5148 KB   
4936/5148 KB   
4940/5148 KB   
4944/5148 KB   
4948/5148 KB   
4951/5148 KB   
4955/5148 KB   
4959/5148 KB   
4963/5148 KB   
4967/5148 KB   
4971/5148 KB   
4975/5148 KB   
4976/5148 KB   
4980/5148 KB   
4984/5148 KB   
4984/5148 KB   
4988/5148 KB   
4992/5148 KB   
4996/5148 KB   
4996/5148 KB   
5000/5148 KB   
5004/5148 KB   
5008/5148 KB   
5012/5148 KB   
5016/5148 KB   
5020/5148 KB   
5024/5148 KB   
5028/5148 KB   
5032/5148 KB   
5036/5148 KB   
5040/5148 KB   
5044/5148 KB   
5048/5148 KB   
5052/5148 KB   
5056/5148 KB   
5060/5148 KB   
5064/5148 KB   
5068/5148 KB   
5072/5148 KB   
5076/5148 KB   
5080/5148 KB   
5084/5148 KB   
5088/5148 KB   
5092/5148 KB   
5096/5148 KB   
5100/5148 KB   
5100/5148 KB   
5104/5148 KB   
5108/5148 KB   
5112/5148 KB   
5116/5148 KB   
5120/5148 KB   
5124/5148 KB   
5128/5148 KB   
5132/5148 KB   
5136/5148 KB   
5140/5148 KB   
5144/5148 KB   
5148/5148 KB   
               
Downloaded: https://repository.apache.org/content/repositories/snapshots/org/apache/hadoop/hadoop-hdfs/3.0.0-SNAPSHOT/hadoop-hdfs-3.0.0-20131015.064525-3536.jar
(5148 KB at 1822.2 KB/sec)
[INFO] 
[INFO] --- maven-clean-plugin:2.4.1:clean (default-clean) @ tez-mapreduce ---
[INFO] Deleting <https://builds.apache.org/job/Tez-Build/ws/tez-mapreduce/target>
[INFO] 
[INFO] --- hadoop-maven-plugins:3.0.0-SNAPSHOT:protoc (compile-protoc) @ tez-mapreduce ---
[INFO] 
[INFO] --- maven-resources-plugin:2.6:resources (default-resources) @ tez-mapreduce ---
[INFO] Using 'UTF-8' encoding to copy filtered resources.
[INFO] skip non existing resourceDirectory <https://builds.apache.org/job/Tez-Build/ws/tez-mapreduce/src/main/resources>
[INFO] 
[INFO] --- maven-compiler-plugin:2.3.2:compile (default-compile) @ tez-mapreduce ---
[WARNING] File encoding has not been set, using platform encoding ISO-8859-1, i.e. build is
platform dependent!
[INFO] Compiling 45 source files to <https://builds.apache.org/job/Tez-Build/ws/tez-mapreduce/target/classes>
[INFO] 
[INFO] --- maven-resources-plugin:2.6:testResources (default-testResources) @ tez-mapreduce
---
[INFO] Using 'UTF-8' encoding to copy filtered resources.
[INFO] Copying 1 resource
[INFO] 
[INFO] --- maven-compiler-plugin:2.3.2:testCompile (default-testCompile) @ tez-mapreduce ---
[WARNING] File encoding has not been set, using platform encoding ISO-8859-1, i.e. build is
platform dependent!
[INFO] Compiling 9 source files to <https://builds.apache.org/job/Tez-Build/ws/tez-mapreduce/target/test-classes>
[INFO] 
[INFO] --- maven-surefire-plugin:2.14.1:test (default-test) @ tez-mapreduce ---
[INFO] Surefire report directory: <https://builds.apache.org/job/Tez-Build/ws/tez-mapreduce/target/surefire-reports>

-------------------------------------------------------
 T E S T S
-------------------------------------------------------

-------------------------------------------------------
 T E S T S
-------------------------------------------------------
Running org.apache.tez.mapreduce.hadoop.TestMRHelpers
Tests run: 10, Failures: 2, Errors: 0, Skipped: 0, Time elapsed: 4.486 sec <<< FAILURE!
testMREnvSetupForReduce(org.apache.tez.mapreduce.hadoop.TestMRHelpers)  Time elapsed: 0.026
sec  <<< FAILURE!
java.lang.AssertionError: null
	at org.junit.Assert.fail(Assert.java:86)
	at org.junit.Assert.assertTrue(Assert.java:41)
	at org.junit.Assert.assertTrue(Assert.java:52)
	at org.apache.tez.mapreduce.hadoop.TestMRHelpers.testCommonEnvSettingsForMRTasks(TestMRHelpers.java:339)
	at org.apache.tez.mapreduce.hadoop.TestMRHelpers.testMREnvSetupForReduce(TestMRHelpers.java:367)

testMREnvSetupForMap(org.apache.tez.mapreduce.hadoop.TestMRHelpers)  Time elapsed: 0.014 sec
 <<< FAILURE!
java.lang.AssertionError: null
	at org.junit.Assert.fail(Assert.java:86)
	at org.junit.Assert.assertTrue(Assert.java:41)
	at org.junit.Assert.assertTrue(Assert.java:52)
	at org.apache.tez.mapreduce.hadoop.TestMRHelpers.testCommonEnvSettingsForMRTasks(TestMRHelpers.java:339)
	at org.apache.tez.mapreduce.hadoop.TestMRHelpers.testMREnvSetupForMap(TestMRHelpers.java:357)

Running org.apache.tez.mapreduce.hadoop.TestConfigTranslationMRToTez
Tests run: 2, Failures: 0, Errors: 0, Skipped: 0, Time elapsed: 0.639 sec
Running org.apache.tez.mapreduce.hadoop.TestDeprecatedKeys
Tests run: 1, Failures: 0, Errors: 0, Skipped: 0, Time elapsed: 0.373 sec
Running org.apache.tez.mapreduce.processor.reduce.TestReduceProcessor
Tests run: 1, Failures: 0, Errors: 0, Skipped: 0, Time elapsed: 1.908 sec
Running org.apache.tez.mapreduce.processor.map.TestMapProcessor
Tests run: 1, Failures: 0, Errors: 0, Skipped: 0, Time elapsed: 1.713 sec
Running org.apache.hadoop.mapred.split.TestGroupedSplits
Tests run: 2, Failures: 0, Errors: 0, Skipped: 0, Time elapsed: 1.957 sec

Results :

Failed tests: 
  TestMRHelpers.testMREnvSetupForReduce:367->testCommonEnvSettingsForMRTasks:339 null
  TestMRHelpers.testMREnvSetupForMap:357->testCommonEnvSettingsForMRTasks:339 null

Tests run: 17, Failures: 2, Errors: 0, Skipped: 0

[INFO] ------------------------------------------------------------------------
[INFO] Reactor Summary:
[INFO] 
[INFO] tez ............................................... SUCCESS [4.168s]
[INFO] tez-api ........................................... SUCCESS [42.859s]
[INFO] tez-common ........................................ SUCCESS [6.845s]
[INFO] tez-runtime-internals ............................. SUCCESS [11.923s]
[INFO] tez-runtime-library ............................... SUCCESS [14.644s]
[INFO] tez-mapreduce ..................................... FAILURE [37.968s]
[INFO] tez-yarn-client ................................... SKIPPED
[INFO] tez-dag ........................................... SKIPPED
[INFO] tez-mapreduce-examples ............................ SKIPPED
[INFO] tez-mapreduce-tests ............................... SKIPPED
[INFO] tez-dist .......................................... SKIPPED
[INFO] Tez ............................................... SKIPPED
[INFO] ------------------------------------------------------------------------
[INFO] BUILD FAILURE
[INFO] ------------------------------------------------------------------------
[INFO] Total time: 1:58.763s
[INFO] Finished at: Tue Oct 15 07:53:04 UTC 2013
[INFO] Final Memory: 110M/509M
[INFO] ------------------------------------------------------------------------
[ERROR] Failed to execute goal org.apache.maven.plugins:maven-surefire-plugin:2.14.1:test
(default-test) on project tez-mapreduce: There are test failures.
[ERROR] 
[ERROR] Please refer to <https://builds.apache.org/job/Tez-Build/ws/tez-mapreduce/target/surefire-reports>
for the individual test results.
[ERROR] -> [Help 1]
[ERROR] 
[ERROR] To see the full stack trace of the errors, re-run Maven with the -e switch.
[ERROR] Re-run Maven using the -X switch to enable full debug logging.
[ERROR] 
[ERROR] For more information about the errors and possible solutions, please read the following
articles:
[ERROR] [Help 1] http://cwiki.apache.org/confluence/display/MAVEN/MojoFailureException
[ERROR] 
[ERROR] After correcting the problems, you can resume the build with the command
[ERROR]   mvn <goals> -rf :tez-mapreduce
Build step 'Execute shell' marked build as failure
Archiving artifacts
Recording test results

Mime
View raw message