tez-dev mailing list archives

Site index · List index
Message view « Date » · « Thread »
Top « Date » · « Thread »
From Apache Jenkins Server <jenk...@builds.apache.org>
Subject Build failed in Jenkins: Tez-Build #179
Date Sat, 26 Oct 2013 00:55:37 GMT
See <https://builds.apache.org/job/Tez-Build/179/changes>

Changes:

[bikas] TEZ-581. Rename MiniMRRTezCluster to MiniTezCluster. Move YARNRunner to tez-mapreduce
project (bikas)

------------------------------------------
[...truncated 1892 lines...]
12 KB   
16 KB   
20 KB   
24 KB   
28 KB   
32 KB   
36 KB   
40 KB   
44 KB   
48 KB   
52 KB   
56 KB   
60 KB   
64 KB   
68 KB   
72 KB   
76 KB   
80 KB   
84 KB   
88 KB   
92 KB   
96 KB   
100 KB   
104 KB   
108 KB   
112 KB   
116 KB   
120 KB   
124 KB   
128 KB   
132 KB   
136 KB   
140 KB   
144 KB   
148 KB   
152 KB   
156 KB   
160 KB   
164 KB   
166 KB   
         
Uploaded: https://repository.apache.org/content/repositories/snapshots/org/apache/tez/tez-mapreduce-examples/0.2.0-SNAPSHOT/tez-mapreduce-examples-0.2.0-20131026.005318-65.jar
(166 KB at 151.9 KB/sec)
Uploading: https://repository.apache.org/content/repositories/snapshots/org/apache/tez/tez-mapreduce-examples/0.2.0-SNAPSHOT/tez-mapreduce-examples-0.2.0-20131026.005318-65.pom
3 KB     
       
Uploaded: https://repository.apache.org/content/repositories/snapshots/org/apache/tez/tez-mapreduce-examples/0.2.0-SNAPSHOT/tez-mapreduce-examples-0.2.0-20131026.005318-65.pom
(3 KB at 9.5 KB/sec)
Downloading: https://repository.apache.org/content/repositories/snapshots/org/apache/tez/tez-mapreduce-examples/maven-metadata.xml
296 B   
        
Downloaded: https://repository.apache.org/content/repositories/snapshots/org/apache/tez/tez-mapreduce-examples/maven-metadata.xml
(296 B at 0.8 KB/sec)
Uploading: https://repository.apache.org/content/repositories/snapshots/org/apache/tez/tez-mapreduce-examples/0.2.0-SNAPSHOT/maven-metadata.xml
1002 B   
         
Uploaded: https://repository.apache.org/content/repositories/snapshots/org/apache/tez/tez-mapreduce-examples/0.2.0-SNAPSHOT/maven-metadata.xml
(1002 B at 2.4 KB/sec)
Uploading: https://repository.apache.org/content/repositories/snapshots/org/apache/tez/tez-mapreduce-examples/maven-metadata.xml
296 B    
        
Uploaded: https://repository.apache.org/content/repositories/snapshots/org/apache/tez/tez-mapreduce-examples/maven-metadata.xml
(296 B at 1.2 KB/sec)
Uploading: https://repository.apache.org/content/repositories/snapshots/org/apache/tez/tez-mapreduce-examples/0.2.0-SNAPSHOT/tez-mapreduce-examples-0.2.0-20131026.005318-65-tests.jar
4 KB    
5 KB   
       
Uploaded: https://repository.apache.org/content/repositories/snapshots/org/apache/tez/tez-mapreduce-examples/0.2.0-SNAPSHOT/tez-mapreduce-examples-0.2.0-20131026.005318-65-tests.jar
(5 KB at 16.5 KB/sec)
Uploading: https://repository.apache.org/content/repositories/snapshots/org/apache/tez/tez-mapreduce-examples/0.2.0-SNAPSHOT/maven-metadata.xml
1002 B   
         
Uploaded: https://repository.apache.org/content/repositories/snapshots/org/apache/tez/tez-mapreduce-examples/0.2.0-SNAPSHOT/maven-metadata.xml
(1002 B at 3.5 KB/sec)
[INFO] 
[INFO] --- maven-resources-plugin:2.6:resources (default-resources) @ tez-mapreduce-examples
---
[INFO] Using 'UTF-8' encoding to copy filtered resources.
[INFO] skip non existing resourceDirectory <https://builds.apache.org/job/Tez-Build/ws/tez-mapreduce-examples/src/main/resources>
[INFO] 
[INFO] --- maven-compiler-plugin:2.3.2:compile (default-compile) @ tez-mapreduce-examples
---
[INFO] Nothing to compile - all classes are up to date
[INFO] 
[INFO] --- maven-resources-plugin:2.6:testResources (default-testResources) @ tez-mapreduce-examples
---
[INFO] Using 'UTF-8' encoding to copy filtered resources.
[INFO] skip non existing resourceDirectory <https://builds.apache.org/job/Tez-Build/ws/tez-mapreduce-examples/src/test/resources>
[INFO] 
[INFO] --- maven-compiler-plugin:2.3.2:testCompile (default-testCompile) @ tez-mapreduce-examples
---
[INFO] Nothing to compile - all classes are up to date
[INFO] 
[INFO] --- maven-surefire-plugin:2.14.1:test (default-test) @ tez-mapreduce-examples ---
[INFO] Skipping execution of surefire because it has already been run for this configuration
[INFO] 
[INFO] --- maven-jar-plugin:2.3.1:jar (default-jar) @ tez-mapreduce-examples ---
[INFO] Building jar: <https://builds.apache.org/job/Tez-Build/ws/tez-mapreduce-examples/target/tez-mapreduce-examples-0.2.0-SNAPSHOT.jar>
[INFO] 
[INFO] --- maven-jar-plugin:2.3.1:test-jar (default) @ tez-mapreduce-examples ---
[INFO] Building jar: <https://builds.apache.org/job/Tez-Build/ws/tez-mapreduce-examples/target/tez-mapreduce-examples-0.2.0-SNAPSHOT-tests.jar>
[INFO]                                                                         
[INFO] ------------------------------------------------------------------------
[INFO] Building tez-tests 0.2.0-SNAPSHOT
[INFO] ------------------------------------------------------------------------
[INFO] 
[INFO] --- maven-clean-plugin:2.4.1:clean (default-clean) @ tez-tests ---
[INFO] 
[INFO] --- maven-resources-plugin:2.6:resources (default-resources) @ tez-tests ---
[INFO] Using 'UTF-8' encoding to copy filtered resources.
[INFO] skip non existing resourceDirectory <https://builds.apache.org/job/Tez-Build/ws/tez-tests/src/main/resources>
[INFO] 
[INFO] --- maven-compiler-plugin:2.3.2:compile (default-compile) @ tez-tests ---
[INFO] No sources to compile
[INFO] 
[INFO] --- maven-resources-plugin:2.6:testResources (default-testResources) @ tez-tests ---
[INFO] Using 'UTF-8' encoding to copy filtered resources.
[INFO] skip non existing resourceDirectory <https://builds.apache.org/job/Tez-Build/ws/tez-tests/src/test/resources>
[INFO] 
[INFO] --- maven-compiler-plugin:2.3.2:testCompile (default-testCompile) @ tez-tests ---
[WARNING] File encoding has not been set, using platform encoding ISO-8859-1, i.e. build is
platform dependent!
[INFO] Compiling 3 source files to <https://builds.apache.org/job/Tez-Build/ws/tez-tests/target/test-classes>
[INFO] 
[INFO] --- maven-surefire-plugin:2.14.1:test (default-test) @ tez-tests ---
[INFO] Surefire report directory: <https://builds.apache.org/job/Tez-Build/ws/tez-tests/target/surefire-reports>

-------------------------------------------------------
 T E S T S
-------------------------------------------------------

-------------------------------------------------------
 T E S T S
-------------------------------------------------------
Running org.apache.tez.mapreduce.TestMRRJobsDAGApi
Tests run: 7, Failures: 0, Errors: 0, Skipped: 0, Time elapsed: 118.535 sec
Running org.apache.tez.mapreduce.TestMRRJobs
Tests run: 5, Failures: 0, Errors: 5, Skipped: 0, Time elapsed: 6.999 sec <<< FAILURE!
testMRRSleepJob(org.apache.tez.mapreduce.TestMRRJobs)  Time elapsed: 0.08 sec  <<<
ERROR!
java.util.ServiceConfigurationError: org.apache.hadoop.mapreduce.protocol.ClientProtocolProvider:
Provider org.apache.tez.mapreduce.YarnTezClientProtocolProvider not found
	at java.util.ServiceLoader.fail(ServiceLoader.java:214)
	at java.util.ServiceLoader.access$400(ServiceLoader.java:164)
	at java.util.ServiceLoader$LazyIterator.next(ServiceLoader.java:350)
	at java.util.ServiceLoader$1.next(ServiceLoader.java:421)
	at org.apache.hadoop.mapreduce.Cluster.initialize(Cluster.java:89)
	at org.apache.hadoop.mapreduce.Cluster.<init>(Cluster.java:82)
	at org.apache.hadoop.mapreduce.Cluster.<init>(Cluster.java:75)
	at org.apache.hadoop.mapreduce.Job$9.run(Job.java:1238)
	at org.apache.hadoop.mapreduce.Job$9.run(Job.java:1234)
	at java.security.AccessController.doPrivileged(Native Method)
	at javax.security.auth.Subject.doAs(Subject.java:396)
	at org.apache.hadoop.security.UserGroupInformation.doAs(UserGroupInformation.java:1507)
	at org.apache.hadoop.mapreduce.Job.connect(Job.java:1233)
	at org.apache.hadoop.mapreduce.Job.submit(Job.java:1262)
	at org.apache.tez.mapreduce.TestMRRJobs.testMRRSleepJob(TestMRRJobs.java:128)

testMRRSleepJobWithCompression(org.apache.tez.mapreduce.TestMRRJobs)  Time elapsed: 0.009
sec  <<< ERROR!
java.io.IOException: Cannot initialize Cluster. Please check your configuration for mapreduce.framework.name
and the correspond server addresses.
	at org.apache.hadoop.mapreduce.Cluster.initialize(Cluster.java:120)
	at org.apache.hadoop.mapreduce.Cluster.<init>(Cluster.java:82)
	at org.apache.hadoop.mapreduce.Cluster.<init>(Cluster.java:75)
	at org.apache.hadoop.mapreduce.Job$9.run(Job.java:1238)
	at org.apache.hadoop.mapreduce.Job$9.run(Job.java:1234)
	at java.security.AccessController.doPrivileged(Native Method)
	at javax.security.auth.Subject.doAs(Subject.java:396)
	at org.apache.hadoop.security.UserGroupInformation.doAs(UserGroupInformation.java:1507)
	at org.apache.hadoop.mapreduce.Job.connect(Job.java:1233)
	at org.apache.hadoop.mapreduce.Job.submit(Job.java:1262)
	at org.apache.tez.mapreduce.TestMRRJobs.testMRRSleepJobWithCompression(TestMRRJobs.java:286)

testFailingAttempt(org.apache.tez.mapreduce.TestMRRJobs)  Time elapsed: 0.005 sec  <<<
ERROR!
java.io.IOException: Cannot initialize Cluster. Please check your configuration for mapreduce.framework.name
and the correspond server addresses.
	at org.apache.hadoop.mapreduce.Cluster.initialize(Cluster.java:120)
	at org.apache.hadoop.mapreduce.Cluster.<init>(Cluster.java:82)
	at org.apache.hadoop.mapreduce.Cluster.<init>(Cluster.java:75)
	at org.apache.hadoop.mapreduce.Job$9.run(Job.java:1238)
	at org.apache.hadoop.mapreduce.Job$9.run(Job.java:1234)
	at java.security.AccessController.doPrivileged(Native Method)
	at javax.security.auth.Subject.doAs(Subject.java:396)
	at org.apache.hadoop.security.UserGroupInformation.doAs(UserGroupInformation.java:1507)
	at org.apache.hadoop.mapreduce.Job.connect(Job.java:1233)
	at org.apache.hadoop.mapreduce.Job.submit(Job.java:1262)
	at org.apache.tez.mapreduce.TestMRRJobs.testFailingAttempt(TestMRRJobs.java:250)

testFailingJob(org.apache.tez.mapreduce.TestMRRJobs)  Time elapsed: 0.004 sec  <<<
ERROR!
java.io.IOException: Cannot initialize Cluster. Please check your configuration for mapreduce.framework.name
and the correspond server addresses.
	at org.apache.hadoop.mapreduce.Cluster.initialize(Cluster.java:120)
	at org.apache.hadoop.mapreduce.Cluster.<init>(Cluster.java:82)
	at org.apache.hadoop.mapreduce.Cluster.<init>(Cluster.java:75)
	at org.apache.hadoop.mapreduce.Job$9.run(Job.java:1238)
	at org.apache.hadoop.mapreduce.Job$9.run(Job.java:1234)
	at java.security.AccessController.doPrivileged(Native Method)
	at javax.security.auth.Subject.doAs(Subject.java:396)
	at org.apache.hadoop.security.UserGroupInformation.doAs(UserGroupInformation.java:1507)
	at org.apache.hadoop.mapreduce.Job.connect(Job.java:1233)
	at org.apache.hadoop.mapreduce.Job.submit(Job.java:1262)
	at org.apache.tez.mapreduce.TestMRRJobs.testFailingJob(TestMRRJobs.java:216)

testRandomWriter(org.apache.tez.mapreduce.TestMRRJobs)  Time elapsed: 0.01 sec  <<<
ERROR!
java.io.IOException: Cannot initialize Cluster. Please check your configuration for mapreduce.framework.name
and the correspond server addresses.
	at org.apache.hadoop.mapreduce.Cluster.initialize(Cluster.java:120)
	at org.apache.hadoop.mapreduce.Cluster.<init>(Cluster.java:82)
	at org.apache.hadoop.mapreduce.Cluster.<init>(Cluster.java:75)
	at org.apache.hadoop.mapreduce.Job$9.run(Job.java:1238)
	at org.apache.hadoop.mapreduce.Job$9.run(Job.java:1234)
	at java.security.AccessController.doPrivileged(Native Method)
	at javax.security.auth.Subject.doAs(Subject.java:396)
	at org.apache.hadoop.security.UserGroupInformation.doAs(UserGroupInformation.java:1507)
	at org.apache.hadoop.mapreduce.Job.connect(Job.java:1233)
	at org.apache.hadoop.mapreduce.Job.submit(Job.java:1262)
	at org.apache.tez.mapreduce.TestMRRJobs.testRandomWriter(TestMRRJobs.java:163)


Results :

Tests in error: 
  TestMRRJobs.testMRRSleepJob:128 » ServiceConfiguration org.apache.hadoop.mapre...
  TestMRRJobs.testMRRSleepJobWithCompression:286 » IO Cannot initialize Cluster....
  TestMRRJobs.testFailingAttempt:250 » IO Cannot initialize Cluster. Please chec...
  TestMRRJobs.testFailingJob:216 » IO Cannot initialize Cluster. Please check yo...
  TestMRRJobs.testRandomWriter:163 » IO Cannot initialize Cluster. Please check ...

Tests run: 12, Failures: 0, Errors: 5, Skipped: 0

[INFO] ------------------------------------------------------------------------
[INFO] Reactor Summary:
[INFO] 
[INFO] tez ............................................... SUCCESS [3.229s]
[INFO] tez-api ........................................... SUCCESS [22.649s]
[INFO] tez-common ........................................ SUCCESS [3.844s]
[INFO] tez-runtime-internals ............................. SUCCESS [7.695s]
[INFO] tez-runtime-library ............................... SUCCESS [13.329s]
[INFO] tez-mapreduce ..................................... SUCCESS [24.203s]
[INFO] tez-dag ........................................... SUCCESS [34.796s]
[INFO] tez-mapreduce-examples ............................ SUCCESS [7.037s]
[INFO] tez-tests ......................................... FAILURE [2:07.852s]
[INFO] tez-dist .......................................... SKIPPED
[INFO] Tez ............................................... SKIPPED
[INFO] ------------------------------------------------------------------------
[INFO] BUILD FAILURE
[INFO] ------------------------------------------------------------------------
[INFO] Total time: 4:04.943s
[INFO] Finished at: Sat Oct 26 00:55:29 UTC 2013
[INFO] Final Memory: 153M/693M
[INFO] ------------------------------------------------------------------------
[ERROR] Failed to execute goal org.apache.maven.plugins:maven-surefire-plugin:2.14.1:test
(default-test) on project tez-tests: There are test failures.
[ERROR] 
[ERROR] Please refer to <https://builds.apache.org/job/Tez-Build/ws/tez-tests/target/surefire-reports>
for the individual test results.
[ERROR] -> [Help 1]
[ERROR] 
[ERROR] To see the full stack trace of the errors, re-run Maven with the -e switch.
[ERROR] Re-run Maven using the -X switch to enable full debug logging.
[ERROR] 
[ERROR] For more information about the errors and possible solutions, please read the following
articles:
[ERROR] [Help 1] http://cwiki.apache.org/confluence/display/MAVEN/MojoFailureException
[ERROR] 
[ERROR] After correcting the problems, you can resume the build with the command
[ERROR]   mvn <goals> -rf :tez-tests
Build step 'Execute shell' marked build as failure
Archiving artifacts
Recording test results

Mime
View raw message