tez-dev mailing list archives

Site index · List index
Message view « Date » · « Thread »
Top « Date » · « Thread »
From Apache Jenkins Server <jenk...@builds.apache.org>
Subject Build failed in Jenkins: Tez-Build #161
Date Tue, 15 Oct 2013 02:27:39 GMT
See <https://builds.apache.org/job/Tez-Build/161/changes>

Changes:

[sseth] TEZ-560. Change MRInputLegacy to avoid RecordReader initialization in the

[bikas] TEZ-553. Mini mrr tez cluster should setup Yarn site automatically (bikas)

[bikas] TEZ-541. Containers should exit when a heartbeat fails (bikas)

[sseth] TEZ-560 addedndum. Change MRInputLegacy to avoid RecordReader

------------------------------------------
[...truncated 748 lines...]
Downloading: https://repository.apache.org/content/repositories/snapshots/org/apache/tez/tez-runtime-library/0.2.0-SNAPSHOT/maven-metadata.xml
999 B    
        
Downloaded: https://repository.apache.org/content/repositories/snapshots/org/apache/tez/tez-runtime-library/0.2.0-SNAPSHOT/maven-metadata.xml
(999 B at 2.8 KB/sec)
Uploading: https://repository.apache.org/content/repositories/snapshots/org/apache/tez/tez-runtime-library/0.2.0-SNAPSHOT/tez-runtime-library-0.2.0-20131015.022713-37.jar
4 KB    
8 KB   
12 KB   
16 KB   
20 KB   
24 KB   
28 KB   
32 KB   
36 KB   
40 KB   
44 KB   
48 KB   
52 KB   
56 KB   
60 KB   
64 KB   
68 KB   
72 KB   
76 KB   
80 KB   
84 KB   
88 KB   
92 KB   
96 KB   
100 KB   
104 KB   
108 KB   
112 KB   
116 KB   
120 KB   
124 KB   
128 KB   
132 KB   
136 KB   
140 KB   
144 KB   
148 KB   
152 KB   
156 KB   
160 KB   
164 KB   
168 KB   
172 KB   
176 KB   
180 KB   
184 KB   
188 KB   
192 KB   
196 KB   
200 KB   
204 KB   
208 KB   
212 KB   
216 KB   
220 KB   
224 KB   
228 KB   
232 KB   
236 KB   
240 KB   
244 KB   
248 KB   
252 KB   
256 KB   
260 KB   
264 KB   
268 KB   
272 KB   
276 KB   
280 KB   
284 KB   
288 KB   
292 KB   
296 KB   
300 KB   
304 KB   
308 KB   
         
Uploaded: https://repository.apache.org/content/repositories/snapshots/org/apache/tez/tez-runtime-library/0.2.0-SNAPSHOT/tez-runtime-library-0.2.0-20131015.022713-37.jar
(308 KB at 555.2 KB/sec)
Uploading: https://repository.apache.org/content/repositories/snapshots/org/apache/tez/tez-runtime-library/0.2.0-SNAPSHOT/tez-runtime-library-0.2.0-20131015.022713-37.pom
3 KB     
       
Uploaded: https://repository.apache.org/content/repositories/snapshots/org/apache/tez/tez-runtime-library/0.2.0-SNAPSHOT/tez-runtime-library-0.2.0-20131015.022713-37.pom
(3 KB at 18.8 KB/sec)
Downloading: https://repository.apache.org/content/repositories/snapshots/org/apache/tez/tez-runtime-library/maven-metadata.xml
293 B   
        
Downloaded: https://repository.apache.org/content/repositories/snapshots/org/apache/tez/tez-runtime-library/maven-metadata.xml
(293 B at 1.6 KB/sec)
Uploading: https://repository.apache.org/content/repositories/snapshots/org/apache/tez/tez-runtime-library/0.2.0-SNAPSHOT/maven-metadata.xml
999 B   
        
Uploaded: https://repository.apache.org/content/repositories/snapshots/org/apache/tez/tez-runtime-library/0.2.0-SNAPSHOT/maven-metadata.xml
(999 B at 4.3 KB/sec)
Uploading: https://repository.apache.org/content/repositories/snapshots/org/apache/tez/tez-runtime-library/maven-metadata.xml
293 B   
        
Uploaded: https://repository.apache.org/content/repositories/snapshots/org/apache/tez/tez-runtime-library/maven-metadata.xml
(293 B at 1.2 KB/sec)
Uploading: https://repository.apache.org/content/repositories/snapshots/org/apache/tez/tez-runtime-library/0.2.0-SNAPSHOT/tez-runtime-library-0.2.0-20131015.022713-37-tests.jar
4 KB    
8 KB   
12 KB   
16 KB   
17 KB   
        
Uploaded: https://repository.apache.org/content/repositories/snapshots/org/apache/tez/tez-runtime-library/0.2.0-SNAPSHOT/tez-runtime-library-0.2.0-20131015.022713-37-tests.jar
(17 KB at 98.8 KB/sec)
Uploading: https://repository.apache.org/content/repositories/snapshots/org/apache/tez/tez-runtime-library/0.2.0-SNAPSHOT/maven-metadata.xml
999 B   
        
Uploaded: https://repository.apache.org/content/repositories/snapshots/org/apache/tez/tez-runtime-library/0.2.0-SNAPSHOT/maven-metadata.xml
(999 B at 7.1 KB/sec)
[INFO] 
[INFO] --- hadoop-maven-plugins:3.0.0-SNAPSHOT:protoc (compile-protoc) @ tez-runtime-library
---
[INFO] 
[INFO] --- maven-resources-plugin:2.6:resources (default-resources) @ tez-runtime-library
---
[INFO] Using 'UTF-8' encoding to copy filtered resources.
[INFO] skip non existing resourceDirectory <https://builds.apache.org/job/Tez-Build/ws/tez-runtime-library/src/main/resources>
[INFO] 
[INFO] --- maven-compiler-plugin:2.3.2:compile (default-compile) @ tez-runtime-library ---
[WARNING] File encoding has not been set, using platform encoding ISO-8859-1, i.e. build is
platform dependent!
[INFO] Compiling 1 source file to <https://builds.apache.org/job/Tez-Build/ws/tez-runtime-library/target/classes>
[INFO] 
[INFO] --- maven-resources-plugin:2.6:testResources (default-testResources) @ tez-runtime-library
---
[INFO] Using 'UTF-8' encoding to copy filtered resources.
[INFO] skip non existing resourceDirectory <https://builds.apache.org/job/Tez-Build/ws/tez-runtime-library/src/test/resources>
[INFO] 
[INFO] --- maven-compiler-plugin:2.3.2:testCompile (default-testCompile) @ tez-runtime-library
---
[INFO] Nothing to compile - all classes are up to date
[INFO] 
[INFO] --- maven-surefire-plugin:2.14.1:test (default-test) @ tez-runtime-library ---
[INFO] Skipping execution of surefire because it has already been run for this configuration
[INFO] 
[INFO] --- maven-jar-plugin:2.3.1:jar (default-jar) @ tez-runtime-library ---
[INFO] Building jar: <https://builds.apache.org/job/Tez-Build/ws/tez-runtime-library/target/tez-runtime-library-0.2.0-SNAPSHOT.jar>
[INFO] 
[INFO] --- maven-jar-plugin:2.3.1:test-jar (default) @ tez-runtime-library ---
[INFO] Building jar: <https://builds.apache.org/job/Tez-Build/ws/tez-runtime-library/target/tez-runtime-library-0.2.0-SNAPSHOT-tests.jar>
[INFO]                                                                         
[INFO] ------------------------------------------------------------------------
[INFO] Building tez-mapreduce 0.2.0-SNAPSHOT
[INFO] ------------------------------------------------------------------------
[INFO] 
[INFO] --- maven-clean-plugin:2.4.1:clean (default-clean) @ tez-mapreduce ---
[INFO] Deleting <https://builds.apache.org/job/Tez-Build/ws/tez-mapreduce/target>
[INFO] 
[INFO] --- hadoop-maven-plugins:3.0.0-SNAPSHOT:protoc (compile-protoc) @ tez-mapreduce ---
[INFO] 
[INFO] --- maven-resources-plugin:2.6:resources (default-resources) @ tez-mapreduce ---
[INFO] Using 'UTF-8' encoding to copy filtered resources.
[INFO] skip non existing resourceDirectory <https://builds.apache.org/job/Tez-Build/ws/tez-mapreduce/src/main/resources>
[INFO] 
[INFO] --- maven-compiler-plugin:2.3.2:compile (default-compile) @ tez-mapreduce ---
[WARNING] File encoding has not been set, using platform encoding ISO-8859-1, i.e. build is
platform dependent!
[INFO] Compiling 45 source files to <https://builds.apache.org/job/Tez-Build/ws/tez-mapreduce/target/classes>
[INFO] 
[INFO] --- maven-resources-plugin:2.6:testResources (default-testResources) @ tez-mapreduce
---
[INFO] Using 'UTF-8' encoding to copy filtered resources.
[INFO] Copying 1 resource
[INFO] 
[INFO] --- maven-compiler-plugin:2.3.2:testCompile (default-testCompile) @ tez-mapreduce ---
[WARNING] File encoding has not been set, using platform encoding ISO-8859-1, i.e. build is
platform dependent!
[INFO] Compiling 9 source files to <https://builds.apache.org/job/Tez-Build/ws/tez-mapreduce/target/test-classes>
[INFO] 
[INFO] --- maven-surefire-plugin:2.14.1:test (default-test) @ tez-mapreduce ---
[INFO] Surefire report directory: <https://builds.apache.org/job/Tez-Build/ws/tez-mapreduce/target/surefire-reports>

-------------------------------------------------------
 T E S T S
-------------------------------------------------------

-------------------------------------------------------
 T E S T S
-------------------------------------------------------
Running org.apache.tez.mapreduce.hadoop.TestConfigTranslationMRToTez
Tests run: 2, Failures: 0, Errors: 0, Skipped: 0, Time elapsed: 0.606 sec
Running org.apache.tez.mapreduce.hadoop.TestMRHelpers
Tests run: 10, Failures: 2, Errors: 0, Skipped: 0, Time elapsed: 4.292 sec <<< FAILURE!
testMREnvSetupForReduce(org.apache.tez.mapreduce.hadoop.TestMRHelpers)  Time elapsed: 0.028
sec  <<< FAILURE!
java.lang.AssertionError: null
	at org.junit.Assert.fail(Assert.java:86)
	at org.junit.Assert.assertTrue(Assert.java:41)
	at org.junit.Assert.assertTrue(Assert.java:52)
	at org.apache.tez.mapreduce.hadoop.TestMRHelpers.testCommonEnvSettingsForMRTasks(TestMRHelpers.java:339)
	at org.apache.tez.mapreduce.hadoop.TestMRHelpers.testMREnvSetupForReduce(TestMRHelpers.java:367)

testMREnvSetupForMap(org.apache.tez.mapreduce.hadoop.TestMRHelpers)  Time elapsed: 0.017 sec
 <<< FAILURE!
java.lang.AssertionError: null
	at org.junit.Assert.fail(Assert.java:86)
	at org.junit.Assert.assertTrue(Assert.java:41)
	at org.junit.Assert.assertTrue(Assert.java:52)
	at org.apache.tez.mapreduce.hadoop.TestMRHelpers.testCommonEnvSettingsForMRTasks(TestMRHelpers.java:339)
	at org.apache.tez.mapreduce.hadoop.TestMRHelpers.testMREnvSetupForMap(TestMRHelpers.java:357)

Running org.apache.tez.mapreduce.hadoop.TestDeprecatedKeys
Tests run: 1, Failures: 0, Errors: 0, Skipped: 0, Time elapsed: 0.354 sec
Running org.apache.tez.mapreduce.processor.reduce.TestReduceProcessor
Tests run: 1, Failures: 0, Errors: 0, Skipped: 0, Time elapsed: 1.868 sec
Running org.apache.tez.mapreduce.processor.map.TestMapProcessor
Tests run: 1, Failures: 0, Errors: 0, Skipped: 0, Time elapsed: 1.56 sec
Running org.apache.hadoop.mapred.split.TestGroupedSplits
Tests run: 2, Failures: 0, Errors: 0, Skipped: 0, Time elapsed: 1.772 sec

Results :

Failed tests: 
  TestMRHelpers.testMREnvSetupForReduce:367->testCommonEnvSettingsForMRTasks:339 null
  TestMRHelpers.testMREnvSetupForMap:357->testCommonEnvSettingsForMRTasks:339 null

Tests run: 17, Failures: 2, Errors: 0, Skipped: 0

[INFO] ------------------------------------------------------------------------
[INFO] Reactor Summary:
[INFO] 
[INFO] tez ............................................... SUCCESS [2.805s]
[INFO] tez-api ........................................... SUCCESS [20.675s]
[INFO] tez-common ........................................ SUCCESS [3.819s]
[INFO] tez-runtime-internals ............................. SUCCESS [6.714s]
[INFO] tez-runtime-library ............................... SUCCESS [12.179s]
[INFO] tez-mapreduce ..................................... FAILURE [16.008s]
[INFO] tez-yarn-client ................................... SKIPPED
[INFO] tez-dag ........................................... SKIPPED
[INFO] tez-mapreduce-examples ............................ SKIPPED
[INFO] tez-mapreduce-tests ............................... SKIPPED
[INFO] tez-dist .......................................... SKIPPED
[INFO] Tez ............................................... SKIPPED
[INFO] ------------------------------------------------------------------------
[INFO] BUILD FAILURE
[INFO] ------------------------------------------------------------------------
[INFO] Total time: 1:02.507s
[INFO] Finished at: Tue Oct 15 02:27:32 UTC 2013
[INFO] Final Memory: 110M/462M
[INFO] ------------------------------------------------------------------------
[ERROR] Failed to execute goal org.apache.maven.plugins:maven-surefire-plugin:2.14.1:test
(default-test) on project tez-mapreduce: There are test failures.
[ERROR] 
[ERROR] Please refer to <https://builds.apache.org/job/Tez-Build/ws/tez-mapreduce/target/surefire-reports>
for the individual test results.
[ERROR] -> [Help 1]
[ERROR] 
[ERROR] To see the full stack trace of the errors, re-run Maven with the -e switch.
[ERROR] Re-run Maven using the -X switch to enable full debug logging.
[ERROR] 
[ERROR] For more information about the errors and possible solutions, please read the following
articles:
[ERROR] [Help 1] http://cwiki.apache.org/confluence/display/MAVEN/MojoFailureException
[ERROR] 
[ERROR] After correcting the problems, you can resume the build with the command
[ERROR]   mvn <goals> -rf :tez-mapreduce
Build step 'Execute shell' marked build as failure
Archiving artifacts
Recording test results

Mime
View raw message