tez-dev mailing list archives

Site index · List index
Message view « Date » · « Thread »
Top « Date » · « Thread »
From Apache Jenkins Server <jenk...@builds.apache.org>
Subject Build failed in Jenkins: Tez-Build #200
Date Tue, 12 Nov 2013 21:08:04 GMT
See <https://builds.apache.org/job/Tez-Build/200/changes>

Changes:

[bikas] TEZ-608. Fix 1-1 edge connection when parallelism is determined at runtime (bikas)

[hitesh] TEZ-610. Update INSTALL.txt. (hitesh)

------------------------------------------
[...truncated 1329 lines...]
156/219 KB   
158/219 KB   
160/219 KB   
162/219 KB   
164/219 KB   
166/219 KB   
168/219 KB   
170/219 KB   
172/219 KB   
174/219 KB   
176/219 KB   
178/219 KB   
180/219 KB   
182/219 KB   
184/219 KB   
186/219 KB   
188/219 KB   
190/219 KB   
192/219 KB   
194/219 KB   
196/219 KB   
198/219 KB   
200/219 KB   
202/219 KB   
204/219 KB   
206/219 KB   
208/219 KB   
210/219 KB   
212/219 KB   
214/219 KB   
216/219 KB   
218/219 KB   
219/219 KB   
             
Uploaded: https://repository.apache.org/content/repositories/snapshots/org/apache/tez/tez-mapreduce/0.2.0-SNAPSHOT/tez-mapreduce-0.2.0-20131112.210716-144.jar
(219 KB at 188.2 KB/sec)
Uploading: https://repository.apache.org/content/repositories/snapshots/org/apache/tez/tez-mapreduce/0.2.0-SNAPSHOT/tez-mapreduce-0.2.0-20131112.210716-144.pom
2/5 KB       
4/5 KB   
5/5 KB   
         
Uploaded: https://repository.apache.org/content/repositories/snapshots/org/apache/tez/tez-mapreduce/0.2.0-SNAPSHOT/tez-mapreduce-0.2.0-20131112.210716-144.pom
(5 KB at 8.8 KB/sec)
Downloading: https://repository.apache.org/content/repositories/snapshots/org/apache/tez/tez-mapreduce/maven-metadata.xml
287 B    
        
Downloaded: https://repository.apache.org/content/repositories/snapshots/org/apache/tez/tez-mapreduce/maven-metadata.xml
(287 B at 0.9 KB/sec)
Uploading: https://repository.apache.org/content/repositories/snapshots/org/apache/tez/tez-mapreduce/0.2.0-SNAPSHOT/maven-metadata.xml
997/997 B   
            
Uploaded: https://repository.apache.org/content/repositories/snapshots/org/apache/tez/tez-mapreduce/0.2.0-SNAPSHOT/maven-metadata.xml
(997 B at 3.2 KB/sec)
Uploading: https://repository.apache.org/content/repositories/snapshots/org/apache/tez/tez-mapreduce/maven-metadata.xml
287/287 B   
            
Uploaded: https://repository.apache.org/content/repositories/snapshots/org/apache/tez/tez-mapreduce/maven-metadata.xml
(287 B at 0.6 KB/sec)
Uploading: https://repository.apache.org/content/repositories/snapshots/org/apache/tez/tez-mapreduce/0.2.0-SNAPSHOT/tez-mapreduce-0.2.0-20131112.210716-144-tests.jar
2/35 KB     
4/35 KB   
6/35 KB   
8/35 KB   
10/35 KB   
12/35 KB   
14/35 KB   
16/35 KB   
18/35 KB   
20/35 KB   
22/35 KB   
24/35 KB   
26/35 KB   
28/35 KB   
30/35 KB   
32/35 KB   
34/35 KB   
35/35 KB   
           
Uploaded: https://repository.apache.org/content/repositories/snapshots/org/apache/tez/tez-mapreduce/0.2.0-SNAPSHOT/tez-mapreduce-0.2.0-20131112.210716-144-tests.jar
(35 KB at 47.7 KB/sec)
Uploading: https://repository.apache.org/content/repositories/snapshots/org/apache/tez/tez-mapreduce/0.2.0-SNAPSHOT/maven-metadata.xml
997/997 B   
            
Uploaded: https://repository.apache.org/content/repositories/snapshots/org/apache/tez/tez-mapreduce/0.2.0-SNAPSHOT/maven-metadata.xml
(997 B at 2.5 KB/sec)
[INFO] 
[INFO] --- hadoop-maven-plugins:2.2.0:protoc (compile-protoc) @ tez-mapreduce ---
[INFO] 
[INFO] --- maven-resources-plugin:2.6:resources (default-resources) @ tez-mapreduce ---
[INFO] Using 'UTF-8' encoding to copy filtered resources.
[INFO] Copying 1 resource
[INFO] 
[INFO] --- maven-compiler-plugin:2.3.2:compile (default-compile) @ tez-mapreduce ---
[WARNING] File encoding has not been set, using platform encoding ISO-8859-1, i.e. build is
platform dependent!
[INFO] Compiling 5 source files to <https://builds.apache.org/job/Tez-Build/ws/tez-mapreduce/target/classes>
[INFO] 
[INFO] --- maven-resources-plugin:2.6:testResources (default-testResources) @ tez-mapreduce
---
[INFO] Using 'UTF-8' encoding to copy filtered resources.
[INFO] Copying 1 resource
[INFO] 
[INFO] --- maven-compiler-plugin:2.3.2:testCompile (default-testCompile) @ tez-mapreduce ---
[INFO] Nothing to compile - all classes are up to date
[INFO] 
[INFO] --- maven-surefire-plugin:2.14.1:test (default-test) @ tez-mapreduce ---
[INFO] Skipping execution of surefire because it has already been run for this configuration
[INFO] 
[INFO] --- maven-jar-plugin:2.3.1:jar (default-jar) @ tez-mapreduce ---
[INFO] Building jar: <https://builds.apache.org/job/Tez-Build/ws/tez-mapreduce/target/tez-mapreduce-0.2.0-SNAPSHOT.jar>
[INFO] 
[INFO] --- maven-jar-plugin:2.3.1:test-jar (default) @ tez-mapreduce ---
[INFO] Building jar: <https://builds.apache.org/job/Tez-Build/ws/tez-mapreduce/target/tez-mapreduce-0.2.0-SNAPSHOT-tests.jar>
[INFO]                                                                         
[INFO] ------------------------------------------------------------------------
[INFO] Building tez-dag 0.2.0-SNAPSHOT
[INFO] ------------------------------------------------------------------------
[INFO] 
[INFO] --- maven-clean-plugin:2.4.1:clean (default-clean) @ tez-dag ---
[INFO] Deleting <https://builds.apache.org/job/Tez-Build/ws/tez-dag/target>
[INFO] 
[INFO] --- avro-maven-plugin:1.5.3:protocol (default) @ tez-dag ---
[INFO] 
[INFO] --- maven-resources-plugin:2.6:resources (default-resources) @ tez-dag ---
[INFO] Using 'UTF-8' encoding to copy filtered resources.
[INFO] Copying 2 resources
[INFO] 
[INFO] --- maven-compiler-plugin:2.3.2:compile (default-compile) @ tez-dag ---
[WARNING] File encoding has not been set, using platform encoding ISO-8859-1, i.e. build is
platform dependent!
[INFO] Compiling 215 source files to <https://builds.apache.org/job/Tez-Build/ws/tez-dag/target/classes>
[INFO] 
[INFO] --- maven-resources-plugin:2.6:testResources (default-testResources) @ tez-dag ---
[INFO] Using 'UTF-8' encoding to copy filtered resources.
[INFO] Copying 1 resource
[INFO] 
[INFO] --- maven-compiler-plugin:2.3.2:testCompile (default-testCompile) @ tez-dag ---
[WARNING] File encoding has not been set, using platform encoding ISO-8859-1, i.e. build is
platform dependent!
[INFO] Compiling 11 source files to <https://builds.apache.org/job/Tez-Build/ws/tez-dag/target/test-classes>
[INFO] 
[INFO] --- maven-surefire-plugin:2.14.1:test (default-test) @ tez-dag ---
[INFO] Surefire report directory: <https://builds.apache.org/job/Tez-Build/ws/tez-dag/target/surefire-reports>

-------------------------------------------------------
 T E S T S
-------------------------------------------------------

-------------------------------------------------------
 T E S T S
-------------------------------------------------------
Running org.apache.tez.dag.app.dag.impl.TestDAGScheduler
Tests run: 2, Failures: 0, Errors: 0, Skipped: 1, Time elapsed: 0.607 sec
Running org.apache.tez.dag.app.dag.impl.TestTaskAttempt
Tests run: 7, Failures: 0, Errors: 0, Skipped: 0, Time elapsed: 1.683 sec
Running org.apache.tez.dag.app.dag.impl.TestVertexScheduler
Tests run: 2, Failures: 0, Errors: 0, Skipped: 0, Time elapsed: 0.686 sec
Running org.apache.tez.dag.app.dag.impl.TestDAGImpl
Tests run: 13, Failures: 0, Errors: 0, Skipped: 1, Time elapsed: 2.153 sec
Running org.apache.tez.dag.app.dag.impl.TestTaskImpl
Tests run: 12, Failures: 0, Errors: 0, Skipped: 0, Time elapsed: 1.202 sec
Running org.apache.tez.dag.app.dag.impl.TestVertexImpl
Tests run: 31, Failures: 0, Errors: 0, Skipped: 1, Time elapsed: 2.839 sec
Running org.apache.tez.dag.app.rm.container.TestAMContainer
Tests run: 20, Failures: 0, Errors: 0, Skipped: 0, Time elapsed: 1.071 sec
Running org.apache.tez.dag.app.rm.TestContainerReuse
Tests run: 5, Failures: 1, Errors: 0, Skipped: 0, Time elapsed: 2.565 sec <<< FAILURE!
testReuseAcrossVertices(org.apache.tez.dag.app.rm.TestContainerReuse)  Time elapsed: 0.055
sec  <<< FAILURE!
org.mockito.exceptions.verification.WantedButNotInvoked: 
Wanted but not invoked:
taskSchedulerEventHandlerForTest.taskAllocated(
    Mock for TaskAttempt, hashCode: 4167406,
    <any>,
    Container: [ContainerId: container_1_0001_01_000001, NodeId: host1:0, NodeHttpAddress:
host1:0, Resource: <memory:1024, vCores:1>, Priority: 3, Token: null, ]
);
-> at org.apache.tez.dag.app.rm.TestContainerReuse.testReuseAcrossVertices(TestContainerReuse.java:684)

However, there were other interactions with this mock:
-> at org.apache.tez.dag.app.rm.TestContainerReuse.testReuseAcrossVertices(TestContainerReuse.java:636)
-> at org.apache.tez.dag.app.rm.TestContainerReuse.testReuseAcrossVertices(TestContainerReuse.java:636)
-> at org.apache.tez.dag.app.rm.TestContainerReuse.testReuseAcrossVertices(TestContainerReuse.java:636)
-> at org.apache.tez.dag.app.rm.TestContainerReuse.testReuseAcrossVertices(TestContainerReuse.java:637)
-> at org.apache.tez.dag.app.rm.TestContainerReuse.testReuseAcrossVertices(TestContainerReuse.java:637)
-> at org.apache.tez.dag.app.rm.TestContainerReuse.testReuseAcrossVertices(TestContainerReuse.java:637)
-> at org.apache.tez.dag.app.rm.TestContainerReuse.testReuseAcrossVertices(TestContainerReuse.java:637)
-> at org.apache.tez.dag.app.rm.TestContainerReuse.testReuseAcrossVertices(TestContainerReuse.java:639)
-> at org.apache.tez.dag.app.rm.TaskSchedulerAppCallbackWrapper$SetApplicationRegistrationDataCallable.call(TaskSchedulerAppCallbackWrapper.java:252)
-> at org.apache.tez.dag.app.rm.TestContainerReuse.testReuseAcrossVertices(TestContainerReuse.java:675)

	at org.apache.tez.dag.app.rm.TestContainerReuse.testReuseAcrossVertices(TestContainerReuse.java:684)

Running org.apache.tez.dag.app.rm.TestTezAMRMClient
Tests run: 1, Failures: 0, Errors: 0, Skipped: 0, Time elapsed: 0.66 sec
Running org.apache.tez.dag.app.rm.TestTaskScheduler
Tests run: 4, Failures: 0, Errors: 0, Skipped: 0, Time elapsed: 1.204 sec

Results :

Failed tests: 
  TestContainerReuse.testReuseAcrossVertices:684 
Wanted but not invoked:
taskSchedulerEventHandlerForTest.taskAllocated(
    Mock for TaskAttempt, hashCode: 4167406,
    <any>,
    Container: [ContainerId: container_1_0001_01_000001, NodeId: host1:0, NodeHttpAddress:
host1:0, Resource: <memory:1024, vCores:1>, Priority: 3, Token: null, ]
);
-> at org.apache.tez.dag.app.rm.TestContainerReuse.testReuseAcrossVertices(TestContainerReuse.java:684)

However, there were other interactions with this mock:
-> at org.apache.tez.dag.app.rm.TestContainerReuse.testReuseAcrossVertices(TestContainerReuse.java:636)
-> at org.apache.tez.dag.app.rm.TestContainerReuse.testReuseAcrossVertices(TestContainerReuse.java:636)
-> at org.apache.tez.dag.app.rm.TestContainerReuse.testReuseAcrossVertices(TestContainerReuse.java:636)
-> at org.apache.tez.dag.app.rm.TestContainerReuse.testReuseAcrossVertices(TestContainerReuse.java:637)
-> at org.apache.tez.dag.app.rm.TestContainerReuse.testReuseAcrossVertices(TestContainerReuse.java:637)
-> at org.apache.tez.dag.app.rm.TestContainerReuse.testReuseAcrossVertices(TestContainerReuse.java:637)
-> at org.apache.tez.dag.app.rm.TestContainerReuse.testReuseAcrossVertices(TestContainerReuse.java:637)
-> at org.apache.tez.dag.app.rm.TestContainerReuse.testReuseAcrossVertices(TestContainerReuse.java:639)
-> at org.apache.tez.dag.app.rm.TaskSchedulerAppCallbackWrapper$SetApplicationRegistrationDataCallable.call(TaskSchedulerAppCallbackWrapper.java:252)
-> at org.apache.tez.dag.app.rm.TestContainerReuse.testReuseAcrossVertices(TestContainerReuse.java:675)


Tests run: 97, Failures: 1, Errors: 0, Skipped: 3

[INFO] ------------------------------------------------------------------------
[INFO] Reactor Summary:
[INFO] 
[INFO] tez ............................................... SUCCESS [3.289s]
[INFO] tez-api ........................................... SUCCESS [25.256s]
[INFO] tez-common ........................................ SUCCESS [4.972s]
[INFO] tez-runtime-internals ............................. SUCCESS [9.115s]
[INFO] tez-runtime-library ............................... SUCCESS [14.392s]
[INFO] tez-mapreduce ..................................... SUCCESS [26.090s]
[INFO] tez-dag ........................................... FAILURE [26.581s]
[INFO] tez-mapreduce-examples ............................ SKIPPED
[INFO] tez-tests ......................................... SKIPPED
[INFO] tez-dist .......................................... SKIPPED
[INFO] Tez ............................................... SKIPPED
[INFO] ------------------------------------------------------------------------
[INFO] BUILD FAILURE
[INFO] ------------------------------------------------------------------------
[INFO] Total time: 1:50.109s
[INFO] Finished at: Tue Nov 12 21:07:48 UTC 2013
[INFO] Final Memory: 136M/540M
[INFO] ------------------------------------------------------------------------
[ERROR] Failed to execute goal org.apache.maven.plugins:maven-surefire-plugin:2.14.1:test
(default-test) on project tez-dag: There are test failures.
[ERROR] 
[ERROR] Please refer to <https://builds.apache.org/job/Tez-Build/ws/tez-dag/target/surefire-reports>
for the individual test results.
[ERROR] -> [Help 1]
[ERROR] 
[ERROR] To see the full stack trace of the errors, re-run Maven with the -e switch.
[ERROR] Re-run Maven using the -X switch to enable full debug logging.
[ERROR] 
[ERROR] For more information about the errors and possible solutions, please read the following
articles:
[ERROR] [Help 1] http://cwiki.apache.org/confluence/display/MAVEN/MojoFailureException
[ERROR] 
[ERROR] After correcting the problems, you can resume the build with the command
[ERROR]   mvn <goals> -rf :tez-dag
Build step 'Execute shell' marked build as failure
Archiving artifacts
Recording test results

Mime
View raw message