tez-dev mailing list archives

Site index · List index
Message view « Date » · « Thread »
Top « Date » · « Thread »
From Apache Jenkins Server <jenk...@builds.apache.org>
Subject Build failed in Jenkins: Tez-Build #191
Date Wed, 06 Nov 2013 22:53:22 GMT
See <https://builds.apache.org/job/Tez-Build/191/changes>

Changes:

[sseth] TEZ-599. Change MRInputLegacy to initialize the RecordReader when

[hitesh] TEZ-600. Add issues mailing list to public docs. (hitesh)

------------------------------------------
[...truncated 1296 lines...]
88/219 KB   
90/219 KB   
92/219 KB   
94/219 KB   
96/219 KB   
98/219 KB   
100/219 KB   
102/219 KB   
104/219 KB   
106/219 KB   
108/219 KB   
110/219 KB   
112/219 KB   
114/219 KB   
116/219 KB   
118/219 KB   
120/219 KB   
122/219 KB   
124/219 KB   
126/219 KB   
128/219 KB   
130/219 KB   
132/219 KB   
134/219 KB   
136/219 KB   
138/219 KB   
140/219 KB   
142/219 KB   
144/219 KB   
146/219 KB   
148/219 KB   
150/219 KB   
152/219 KB   
154/219 KB   
156/219 KB   
158/219 KB   
160/219 KB   
162/219 KB   
164/219 KB   
166/219 KB   
168/219 KB   
170/219 KB   
172/219 KB   
174/219 KB   
176/219 KB   
178/219 KB   
180/219 KB   
182/219 KB   
184/219 KB   
186/219 KB   
188/219 KB   
190/219 KB   
192/219 KB   
194/219 KB   
196/219 KB   
198/219 KB   
200/219 KB   
202/219 KB   
204/219 KB   
206/219 KB   
208/219 KB   
210/219 KB   
212/219 KB   
214/219 KB   
216/219 KB   
218/219 KB   
219/219 KB   
             
Uploaded: https://repository.apache.org/content/repositories/snapshots/org/apache/tez/tez-mapreduce/0.2.0-SNAPSHOT/tez-mapreduce-0.2.0-20131106.225212-136.jar
(219 KB at 410.2 KB/sec)
Uploading: https://repository.apache.org/content/repositories/snapshots/org/apache/tez/tez-mapreduce/0.2.0-SNAPSHOT/tez-mapreduce-0.2.0-20131106.225212-136.pom
2/5 KB       
4/5 KB   
5/5 KB   
         
Uploaded: https://repository.apache.org/content/repositories/snapshots/org/apache/tez/tez-mapreduce/0.2.0-SNAPSHOT/tez-mapreduce-0.2.0-20131106.225212-136.pom
(5 KB at 12.8 KB/sec)
Downloading: https://repository.apache.org/content/repositories/snapshots/org/apache/tez/tez-mapreduce/maven-metadata.xml
287 B    
        
Downloaded: https://repository.apache.org/content/repositories/snapshots/org/apache/tez/tez-mapreduce/maven-metadata.xml
(287 B at 1.1 KB/sec)
Uploading: https://repository.apache.org/content/repositories/snapshots/org/apache/tez/tez-mapreduce/0.2.0-SNAPSHOT/maven-metadata.xml
997/997 B   
            
Uploaded: https://repository.apache.org/content/repositories/snapshots/org/apache/tez/tez-mapreduce/0.2.0-SNAPSHOT/maven-metadata.xml
(997 B at 3.3 KB/sec)
Uploading: https://repository.apache.org/content/repositories/snapshots/org/apache/tez/tez-mapreduce/maven-metadata.xml
287/287 B   
            
Uploaded: https://repository.apache.org/content/repositories/snapshots/org/apache/tez/tez-mapreduce/maven-metadata.xml
(287 B at 0.8 KB/sec)
Uploading: https://repository.apache.org/content/repositories/snapshots/org/apache/tez/tez-mapreduce/0.2.0-SNAPSHOT/tez-mapreduce-0.2.0-20131106.225212-136-tests.jar
2/35 KB     
4/35 KB   
6/35 KB   
8/35 KB   
10/35 KB   
12/35 KB   
14/35 KB   
16/35 KB   
18/35 KB   
20/35 KB   
22/35 KB   
24/35 KB   
26/35 KB   
28/35 KB   
30/35 KB   
32/35 KB   
34/35 KB   
35/35 KB   
           
Uploaded: https://repository.apache.org/content/repositories/snapshots/org/apache/tez/tez-mapreduce/0.2.0-SNAPSHOT/tez-mapreduce-0.2.0-20131106.225212-136-tests.jar
(35 KB at 81.1 KB/sec)
Uploading: https://repository.apache.org/content/repositories/snapshots/org/apache/tez/tez-mapreduce/0.2.0-SNAPSHOT/maven-metadata.xml
997/997 B   
            
Uploaded: https://repository.apache.org/content/repositories/snapshots/org/apache/tez/tez-mapreduce/0.2.0-SNAPSHOT/maven-metadata.xml
(997 B at 3.0 KB/sec)
[INFO] 
[INFO] --- hadoop-maven-plugins:3.0.0-SNAPSHOT:protoc (compile-protoc) @ tez-mapreduce ---
[INFO] 
[INFO] --- maven-resources-plugin:2.6:resources (default-resources) @ tez-mapreduce ---
[INFO] Using 'UTF-8' encoding to copy filtered resources.
[INFO] Copying 1 resource
[INFO] 
[INFO] --- maven-compiler-plugin:2.3.2:compile (default-compile) @ tez-mapreduce ---
[WARNING] File encoding has not been set, using platform encoding ISO-8859-1, i.e. build is
platform dependent!
[INFO] Compiling 5 source files to <https://builds.apache.org/job/Tez-Build/ws/tez-mapreduce/target/classes>
[INFO] 
[INFO] --- maven-resources-plugin:2.6:testResources (default-testResources) @ tez-mapreduce
---
[INFO] Using 'UTF-8' encoding to copy filtered resources.
[INFO] Copying 1 resource
[INFO] 
[INFO] --- maven-compiler-plugin:2.3.2:testCompile (default-testCompile) @ tez-mapreduce ---
[INFO] Nothing to compile - all classes are up to date
[INFO] 
[INFO] --- maven-surefire-plugin:2.14.1:test (default-test) @ tez-mapreduce ---
[INFO] Skipping execution of surefire because it has already been run for this configuration
[INFO] 
[INFO] --- maven-jar-plugin:2.3.1:jar (default-jar) @ tez-mapreduce ---
[INFO] Building jar: <https://builds.apache.org/job/Tez-Build/ws/tez-mapreduce/target/tez-mapreduce-0.2.0-SNAPSHOT.jar>
[INFO] 
[INFO] --- maven-jar-plugin:2.3.1:test-jar (default) @ tez-mapreduce ---
[INFO] Building jar: <https://builds.apache.org/job/Tez-Build/ws/tez-mapreduce/target/tez-mapreduce-0.2.0-SNAPSHOT-tests.jar>
[INFO]                                                                         
[INFO] ------------------------------------------------------------------------
[INFO] Building tez-dag 0.2.0-SNAPSHOT
[INFO] ------------------------------------------------------------------------
[INFO] 
[INFO] --- maven-clean-plugin:2.4.1:clean (default-clean) @ tez-dag ---
[INFO] Deleting <https://builds.apache.org/job/Tez-Build/ws/tez-dag/target>
[INFO] 
[INFO] --- avro-maven-plugin:1.5.3:protocol (default) @ tez-dag ---
[INFO] 
[INFO] --- maven-resources-plugin:2.6:resources (default-resources) @ tez-dag ---
[INFO] Using 'UTF-8' encoding to copy filtered resources.
[INFO] Copying 2 resources
[INFO] 
[INFO] --- maven-compiler-plugin:2.3.2:compile (default-compile) @ tez-dag ---
[WARNING] File encoding has not been set, using platform encoding ISO-8859-1, i.e. build is
platform dependent!
[INFO] Compiling 214 source files to <https://builds.apache.org/job/Tez-Build/ws/tez-dag/target/classes>
[INFO] 
[INFO] --- maven-resources-plugin:2.6:testResources (default-testResources) @ tez-dag ---
[INFO] Using 'UTF-8' encoding to copy filtered resources.
[INFO] Copying 1 resource
[INFO] 
[INFO] --- maven-compiler-plugin:2.3.2:testCompile (default-testCompile) @ tez-dag ---
[WARNING] File encoding has not been set, using platform encoding ISO-8859-1, i.e. build is
platform dependent!
[INFO] Compiling 11 source files to <https://builds.apache.org/job/Tez-Build/ws/tez-dag/target/test-classes>
[INFO] 
[INFO] --- maven-surefire-plugin:2.14.1:test (default-test) @ tez-dag ---
[INFO] Surefire report directory: <https://builds.apache.org/job/Tez-Build/ws/tez-dag/target/surefire-reports>

-------------------------------------------------------
 T E S T S
-------------------------------------------------------

-------------------------------------------------------
 T E S T S
-------------------------------------------------------
Running org.apache.tez.dag.app.dag.impl.TestDAGScheduler
Tests run: 2, Failures: 0, Errors: 0, Skipped: 1, Time elapsed: 0.62 sec
Running org.apache.tez.dag.app.dag.impl.TestTaskAttempt
Tests run: 7, Failures: 0, Errors: 0, Skipped: 0, Time elapsed: 1.701 sec
Running org.apache.tez.dag.app.dag.impl.TestVertexScheduler
Tests run: 2, Failures: 0, Errors: 0, Skipped: 0, Time elapsed: 0.679 sec
Running org.apache.tez.dag.app.dag.impl.TestDAGImpl
Tests run: 13, Failures: 0, Errors: 0, Skipped: 1, Time elapsed: 2.164 sec
Running org.apache.tez.dag.app.dag.impl.TestTaskImpl
Tests run: 12, Failures: 0, Errors: 0, Skipped: 0, Time elapsed: 1.195 sec
Running org.apache.tez.dag.app.dag.impl.TestVertexImpl
Tests run: 30, Failures: 1, Errors: 0, Skipped: 1, Time elapsed: 2.695 sec <<< FAILURE!
testVertexKill(org.apache.tez.dag.app.dag.impl.TestVertexImpl)  Time elapsed: 0.028 sec  <<<
FAILURE!
java.lang.AssertionError: expected:<INITED> but was:<NEW>
	at org.junit.Assert.fail(Assert.java:88)
	at org.junit.Assert.failNotEquals(Assert.java:743)
	at org.junit.Assert.assertEquals(Assert.java:118)
	at org.junit.Assert.assertEquals(Assert.java:144)
	at org.apache.tez.dag.app.dag.impl.TestVertexImpl.initVertex(TestVertexImpl.java:697)
	at org.apache.tez.dag.app.dag.impl.TestVertexImpl.initAllVertices(TestVertexImpl.java:686)
	at org.apache.tez.dag.app.dag.impl.TestVertexImpl.testVertexKill(TestVertexImpl.java:946)

Running org.apache.tez.dag.app.rm.container.TestAMContainer
Tests run: 20, Failures: 0, Errors: 0, Skipped: 0, Time elapsed: 1.071 sec
Running org.apache.tez.dag.app.rm.TestContainerReuse
Tests run: 5, Failures: 0, Errors: 0, Skipped: 0, Time elapsed: 7.623 sec
Running org.apache.tez.dag.app.rm.TestTezAMRMClient
Tests run: 1, Failures: 0, Errors: 0, Skipped: 0, Time elapsed: 0.666 sec
Running org.apache.tez.dag.app.rm.TestTaskScheduler
Tests run: 3, Failures: 0, Errors: 0, Skipped: 0, Time elapsed: 1.165 sec

Results :

Failed tests: 
  TestVertexImpl.testVertexKill:946->initAllVertices:686->initVertex:697 expected:<INITED>
but was:<NEW>

Tests run: 95, Failures: 1, Errors: 0, Skipped: 3

[INFO] ------------------------------------------------------------------------
[INFO] Reactor Summary:
[INFO] 
[INFO] tez ............................................... SUCCESS [4.782s]
[INFO] tez-api ........................................... SUCCESS [28.723s]
[INFO] tez-common ........................................ SUCCESS [5.038s]
[INFO] tez-runtime-internals ............................. SUCCESS [8.346s]
[INFO] tez-runtime-library ............................... SUCCESS [13.670s]
[INFO] tez-mapreduce ..................................... SUCCESS [27.075s]
[INFO] tez-dag ........................................... FAILURE [31.659s]
[INFO] tez-mapreduce-examples ............................ SKIPPED
[INFO] tez-tests ......................................... SKIPPED
[INFO] tez-dist .......................................... SKIPPED
[INFO] Tez ............................................... SKIPPED
[INFO] ------------------------------------------------------------------------
[INFO] BUILD FAILURE
[INFO] ------------------------------------------------------------------------
[INFO] Total time: 1:59.668s
[INFO] Finished at: Wed Nov 06 22:52:48 UTC 2013
[INFO] Final Memory: 130M/404M
[INFO] ------------------------------------------------------------------------
[ERROR] Failed to execute goal org.apache.maven.plugins:maven-surefire-plugin:2.14.1:test
(default-test) on project tez-dag: There are test failures.
[ERROR] 
[ERROR] Please refer to <https://builds.apache.org/job/Tez-Build/ws/tez-dag/target/surefire-reports>
for the individual test results.
[ERROR] -> [Help 1]
[ERROR] 
[ERROR] To see the full stack trace of the errors, re-run Maven with the -e switch.
[ERROR] Re-run Maven using the -X switch to enable full debug logging.
[ERROR] 
[ERROR] For more information about the errors and possible solutions, please read the following
articles:
[ERROR] [Help 1] http://cwiki.apache.org/confluence/display/MAVEN/MojoFailureException
[ERROR] 
[ERROR] After correcting the problems, you can resume the build with the command
[ERROR]   mvn <goals> -rf :tez-dag
Build step 'Execute shell' marked build as failure
Archiving artifacts
Recording test results

Mime
View raw message