tez-dev mailing list archives

Site index · List index
Message view « Date » · « Thread »
Top « Date » · « Thread »
From Apache Jenkins Server <jenk...@builds.apache.org>
Subject Build failed in Jenkins: Tez-Build #221
Date Wed, 27 Nov 2013 19:23:22 GMT
See <https://builds.apache.org/job/Tez-Build/221/changes>

Changes:

[sseth] TEZ-645. Re-use ID instances in the AM, intern vertex names etc where

------------------------------------------
[...truncated 967 lines...]
[INFO] 
[INFO] --- maven-compiler-plugin:2.3.2:testCompile (default-testCompile) @ tez-mapreduce ---
[INFO] Nothing to compile - all classes are up to date
[INFO] 
[INFO] --- maven-surefire-plugin:2.14.1:test (default-test) @ tez-mapreduce ---
[INFO] Skipping execution of surefire because it has already been run for this configuration
[INFO] 
[INFO] --- maven-jar-plugin:2.3.1:jar (default-jar) @ tez-mapreduce ---
[INFO] Building jar: <https://builds.apache.org/job/Tez-Build/ws/tez-mapreduce/target/tez-mapreduce-0.3.0-SNAPSHOT.jar>
[INFO] 
[INFO] --- maven-jar-plugin:2.3.1:test-jar (default) @ tez-mapreduce ---
[INFO] Building jar: <https://builds.apache.org/job/Tez-Build/ws/tez-mapreduce/target/tez-mapreduce-0.3.0-SNAPSHOT-tests.jar>
[INFO] 
[INFO] --- maven-install-plugin:2.3.1:install (default-install) @ tez-mapreduce ---
[INFO] Installing <https://builds.apache.org/job/Tez-Build/ws/tez-mapreduce/target/tez-mapreduce-0.3.0-SNAPSHOT.jar>
to /home/jenkins/.m2/repository/org/apache/tez/tez-mapreduce/0.3.0-SNAPSHOT/tez-mapreduce-0.3.0-SNAPSHOT.jar
[INFO] Installing <https://builds.apache.org/job/Tez-Build/ws/tez-mapreduce/pom.xml>
to /home/jenkins/.m2/repository/org/apache/tez/tez-mapreduce/0.3.0-SNAPSHOT/tez-mapreduce-0.3.0-SNAPSHOT.pom
[INFO] Installing <https://builds.apache.org/job/Tez-Build/ws/tez-mapreduce/target/tez-mapreduce-0.3.0-SNAPSHOT-tests.jar>
to /home/jenkins/.m2/repository/org/apache/tez/tez-mapreduce/0.3.0-SNAPSHOT/tez-mapreduce-0.3.0-SNAPSHOT-tests.jar
[INFO] 
[INFO] --- maven-deploy-plugin:2.8.1:deploy (default-deploy) @ tez-mapreduce ---
Downloading: https://repository.apache.org/content/repositories/snapshots/org/apache/tez/tez-mapreduce/0.3.0-SNAPSHOT/maven-metadata.xml
989 B   
        
Downloaded: https://repository.apache.org/content/repositories/snapshots/org/apache/tez/tez-mapreduce/0.3.0-SNAPSHOT/maven-metadata.xml
(989 B at 1.3 KB/sec)
Uploading: https://repository.apache.org/content/repositories/snapshots/org/apache/tez/tez-mapreduce/0.3.0-SNAPSHOT/tez-mapreduce-0.3.0-20131127.185224-3.jar
4 KB    
8 KB   
12 KB   
16 KB   
20 KB   
24 KB   
28 KB   
32 KB   
36 KB   
40 KB   
44 KB   
48 KB   
52 KB   
56 KB   
60 KB   
64 KB   
68 KB   
72 KB   
76 KB   
80 KB   
84 KB   
88 KB   
92 KB   
96 KB   
100 KB   
104 KB   
108 KB   
112 KB   
116 KB   
120 KB   
124 KB   
128 KB   
132 KB   
136 KB   
140 KB   
144 KB   
148 KB   
152 KB   
156 KB   
160 KB   
164 KB   
168 KB   
172 KB   
176 KB   
180 KB   
184 KB   
188 KB   
192 KB   
196 KB   
200 KB   
204 KB   
208 KB   
212 KB   
216 KB   
220 KB   
         
Uploaded: https://repository.apache.org/content/repositories/snapshots/org/apache/tez/tez-mapreduce/0.3.0-SNAPSHOT/tez-mapreduce-0.3.0-20131127.185224-3.jar
(220 KB at 281.9 KB/sec)
Uploading: https://repository.apache.org/content/repositories/snapshots/org/apache/tez/tez-mapreduce/0.3.0-SNAPSHOT/tez-mapreduce-0.3.0-20131127.185224-3.pom
4 KB     
5 KB   
       
Uploaded: https://repository.apache.org/content/repositories/snapshots/org/apache/tez/tez-mapreduce/0.3.0-SNAPSHOT/tez-mapreduce-0.3.0-20131127.185224-3.pom
(5 KB at 30.9 KB/sec)
Downloading: https://repository.apache.org/content/repositories/snapshots/org/apache/tez/tez-mapreduce/maven-metadata.xml
408 B   
        
Downloaded: https://repository.apache.org/content/repositories/snapshots/org/apache/tez/tez-mapreduce/maven-metadata.xml
(408 B at 0.1 KB/sec)
Uploading: https://repository.apache.org/content/repositories/snapshots/org/apache/tez/tez-mapreduce/0.3.0-SNAPSHOT/maven-metadata.xml
989 B   
        
Uploaded: https://repository.apache.org/content/repositories/snapshots/org/apache/tez/tez-mapreduce/0.3.0-SNAPSHOT/maven-metadata.xml
(989 B at 1.8 KB/sec)
Uploading: https://repository.apache.org/content/repositories/snapshots/org/apache/tez/tez-mapreduce/maven-metadata.xml
387 B   
        
Uploaded: https://repository.apache.org/content/repositories/snapshots/org/apache/tez/tez-mapreduce/maven-metadata.xml
(387 B at 2.2 KB/sec)
Uploading: https://repository.apache.org/content/repositories/snapshots/org/apache/tez/tez-mapreduce/0.3.0-SNAPSHOT/tez-mapreduce-0.3.0-20131127.185224-3-tests.jar
4 KB    
8 KB   
12 KB   
16 KB   
20 KB   
24 KB   
28 KB   
32 KB   
35 KB   
        
Uploaded: https://repository.apache.org/content/repositories/snapshots/org/apache/tez/tez-mapreduce/0.3.0-SNAPSHOT/tez-mapreduce-0.3.0-20131127.185224-3-tests.jar
(35 KB at 113.6 KB/sec)
Uploading: https://repository.apache.org/content/repositories/snapshots/org/apache/tez/tez-mapreduce/0.3.0-SNAPSHOT/maven-metadata.xml
989 B   
        
Uploaded: https://repository.apache.org/content/repositories/snapshots/org/apache/tez/tez-mapreduce/0.3.0-SNAPSHOT/maven-metadata.xml
(989 B at 3.8 KB/sec)
[INFO] 
[INFO] --- hadoop-maven-plugins:2.2.0:protoc (compile-protoc) @ tez-mapreduce ---
[INFO] 
[INFO] --- maven-resources-plugin:2.6:resources (default-resources) @ tez-mapreduce ---
[INFO] Using 'UTF-8' encoding to copy filtered resources.
[INFO] Copying 1 resource
[INFO] 
[INFO] --- maven-compiler-plugin:2.3.2:compile (default-compile) @ tez-mapreduce ---
[WARNING] File encoding has not been set, using platform encoding ISO-8859-1, i.e. build is
platform dependent!
[INFO] Compiling 5 source files to <https://builds.apache.org/job/Tez-Build/ws/tez-mapreduce/target/classes>
[INFO] 
[INFO] --- maven-resources-plugin:2.6:testResources (default-testResources) @ tez-mapreduce
---
[INFO] Using 'UTF-8' encoding to copy filtered resources.
[INFO] Copying 1 resource
[INFO] 
[INFO] --- maven-compiler-plugin:2.3.2:testCompile (default-testCompile) @ tez-mapreduce ---
[INFO] Nothing to compile - all classes are up to date
[INFO] 
[INFO] --- maven-surefire-plugin:2.14.1:test (default-test) @ tez-mapreduce ---
[INFO] Skipping execution of surefire because it has already been run for this configuration
[INFO] 
[INFO] --- maven-jar-plugin:2.3.1:jar (default-jar) @ tez-mapreduce ---
[INFO] Building jar: <https://builds.apache.org/job/Tez-Build/ws/tez-mapreduce/target/tez-mapreduce-0.3.0-SNAPSHOT.jar>
[INFO] 
[INFO] --- maven-jar-plugin:2.3.1:test-jar (default) @ tez-mapreduce ---
[INFO] Building jar: <https://builds.apache.org/job/Tez-Build/ws/tez-mapreduce/target/tez-mapreduce-0.3.0-SNAPSHOT-tests.jar>
[INFO]                                                                         
[INFO] ------------------------------------------------------------------------
[INFO] Building tez-dag 0.3.0-SNAPSHOT
[INFO] ------------------------------------------------------------------------
[INFO] 
[INFO] --- maven-clean-plugin:2.4.1:clean (default-clean) @ tez-dag ---
[INFO] Deleting <https://builds.apache.org/job/Tez-Build/ws/tez-dag/target>
[INFO] 
[INFO] --- avro-maven-plugin:1.5.3:protocol (default) @ tez-dag ---
[INFO] 
[INFO] --- maven-resources-plugin:2.6:resources (default-resources) @ tez-dag ---
[INFO] Using 'UTF-8' encoding to copy filtered resources.
[INFO] Copying 2 resources
[INFO] 
[INFO] --- maven-compiler-plugin:2.3.2:compile (default-compile) @ tez-dag ---
[WARNING] File encoding has not been set, using platform encoding ISO-8859-1, i.e. build is
platform dependent!
[INFO] Compiling 215 source files to <https://builds.apache.org/job/Tez-Build/ws/tez-dag/target/classes>
[INFO] 
[INFO] --- maven-resources-plugin:2.6:testResources (default-testResources) @ tez-dag ---
[INFO] Using 'UTF-8' encoding to copy filtered resources.
[INFO] Copying 1 resource
[INFO] 
[INFO] --- maven-compiler-plugin:2.3.2:testCompile (default-testCompile) @ tez-dag ---
[WARNING] File encoding has not been set, using platform encoding ISO-8859-1, i.e. build is
platform dependent!
[INFO] Compiling 12 source files to <https://builds.apache.org/job/Tez-Build/ws/tez-dag/target/test-classes>
[INFO] 
[INFO] --- maven-surefire-plugin:2.14.1:test (default-test) @ tez-dag ---
[INFO] Surefire report directory: <https://builds.apache.org/job/Tez-Build/ws/tez-dag/target/surefire-reports>

-------------------------------------------------------
 T E S T S
-------------------------------------------------------

-------------------------------------------------------
 T E S T S
-------------------------------------------------------
Running org.apache.tez.dag.app.rm.TestTaskScheduler
java.lang.OutOfMemoryError: GC overhead limit exceeded
Dumping heap to java_pid4156.hprof ...
Heap dump file created [957040946 bytes in 18.809 secs]
Running org.apache.tez.dag.app.rm.TestContainerReuse
Tests run: 5, Failures: 0, Errors: 0, Skipped: 0, Time elapsed: 7.906 sec
Running org.apache.tez.dag.app.rm.container.TestAMContainer
Tests run: 20, Failures: 0, Errors: 0, Skipped: 0, Time elapsed: 1.023 sec
Running org.apache.tez.dag.app.rm.node.TestAMNodeMap
Tests run: 2, Failures: 0, Errors: 0, Skipped: 0, Time elapsed: 0.513 sec
Running org.apache.tez.dag.app.rm.TestTezAMRMClient
Tests run: 1, Failures: 0, Errors: 0, Skipped: 0, Time elapsed: 0.602 sec
Running org.apache.tez.dag.app.dag.impl.TestTaskAttempt
Tests run: 7, Failures: 0, Errors: 0, Skipped: 0, Time elapsed: 1.366 sec
Running org.apache.tez.dag.app.dag.impl.TestVertexImpl
Running org.apache.tez.dag.app.dag.impl.TestVertexScheduler
Tests run: 2, Failures: 0, Errors: 0, Skipped: 0, Time elapsed: 0.636 sec
Running org.apache.tez.dag.app.dag.impl.TestDAGScheduler
Tests run: 2, Failures: 0, Errors: 0, Skipped: 1, Time elapsed: 0.507 sec
Running org.apache.tez.dag.app.dag.impl.TestTaskImpl
Tests run: 12, Failures: 0, Errors: 0, Skipped: 0, Time elapsed: 1.128 sec
Running org.apache.tez.dag.app.dag.impl.TestDAGImpl
Tests run: 13, Failures: 1, Errors: 0, Skipped: 2, Time elapsed: 1.926 sec <<< FAILURE!
testInvalidEvent(org.apache.tez.dag.app.dag.impl.TestDAGImpl)  Time elapsed: 0.023 sec  <<<
FAILURE!
java.lang.AssertionError: expected:<ERROR> but was:<NEW>
	at org.junit.Assert.fail(Assert.java:88)
	at org.junit.Assert.failNotEquals(Assert.java:743)
	at org.junit.Assert.assertEquals(Assert.java:118)
	at org.junit.Assert.assertEquals(Assert.java:144)
	at org.apache.tez.dag.app.dag.impl.TestDAGImpl.testInvalidEvent(TestDAGImpl.java:705)


Results :

Failed tests: 
  TestDAGImpl.testInvalidEvent:705 expected:<ERROR> but was:<NEW>

Tests run: 64, Failures: 1, Errors: 0, Skipped: 3

[INFO] ------------------------------------------------------------------------
[INFO] Reactor Summary:
[INFO] 
[INFO] tez ............................................... SUCCESS [5.936s]
[INFO] tez-api ........................................... SUCCESS [22.796s]
[INFO] tez-common ........................................ SUCCESS [11.422s]
[INFO] tez-runtime-internals ............................. SUCCESS [10.674s]
[INFO] tez-runtime-library ............................... SUCCESS [12.067s]
[INFO] tez-mapreduce ..................................... SUCCESS [26.383s]
[INFO] tez-dag ........................................... FAILURE [30:24.605s]
[INFO] tez-mapreduce-examples ............................ SKIPPED
[INFO] tez-tests ......................................... SKIPPED
[INFO] tez-dist .......................................... SKIPPED
[INFO] Tez ............................................... SKIPPED
[INFO] ------------------------------------------------------------------------
[INFO] BUILD FAILURE
[INFO] ------------------------------------------------------------------------
[INFO] Total time: 31:54.184s
[INFO] Finished at: Wed Nov 27 19:22:57 UTC 2013
[INFO] Final Memory: 137M/441M
[INFO] ------------------------------------------------------------------------
[ERROR] Failed to execute goal org.apache.maven.plugins:maven-surefire-plugin:2.14.1:test
(default-test) on project tez-dag: There was a timeout or other error in the fork -> [Help
1]
[ERROR] 
[ERROR] To see the full stack trace of the errors, re-run Maven with the -e switch.
[ERROR] Re-run Maven using the -X switch to enable full debug logging.
[ERROR] 
[ERROR] For more information about the errors and possible solutions, please read the following
articles:
[ERROR] [Help 1] http://cwiki.apache.org/confluence/display/MAVEN/MojoFailureException
[ERROR] 
[ERROR] After correcting the problems, you can resume the build with the command
[ERROR]   mvn <goals> -rf :tez-dag
Build step 'Execute shell' marked build as failure
Archiving artifacts
Recording test results

Mime
View raw message