tez-dev mailing list archives

Site index · List index
Message view « Date » · « Thread »
Top « Date » · « Thread »
From Apache Jenkins Server <jenk...@builds.apache.org>
Subject Build failed in Jenkins: Tez-Build #216
Date Mon, 25 Nov 2013 19:53:06 GMT
See <https://builds.apache.org/job/Tez-Build/216/changes>

Changes:

[hitesh] TEZ-640. Support infinite wait when trying to submit DAG to a Session. (hitesh)

[sseth] TEZ-641. Fix exit code for MRRSleepJob. (sseth)

------------------------------------------
[...truncated 722 lines...]
Results :

Tests run: 2, Failures: 0, Errors: 0, Skipped: 0

[INFO] 
[INFO] --- hadoop-maven-plugins:2.2.0:protoc (compile-protoc) @ tez-runtime-internals ---
[INFO] 
[INFO] --- maven-resources-plugin:2.6:resources (default-resources) @ tez-runtime-internals
---
[INFO] Using 'UTF-8' encoding to copy filtered resources.
[INFO] skip non existing resourceDirectory <https://builds.apache.org/job/Tez-Build/ws/tez-runtime-internals/src/main/resources>
[INFO] 
[INFO] --- maven-compiler-plugin:2.3.2:compile (default-compile) @ tez-runtime-internals ---
[WARNING] File encoding has not been set, using platform encoding ISO-8859-1, i.e. build is
platform dependent!
[INFO] Compiling 1 source file to <https://builds.apache.org/job/Tez-Build/ws/tez-runtime-internals/target/classes>
[INFO] 
[INFO] --- maven-resources-plugin:2.6:testResources (default-testResources) @ tez-runtime-internals
---
[INFO] Using 'UTF-8' encoding to copy filtered resources.
[INFO] skip non existing resourceDirectory <https://builds.apache.org/job/Tez-Build/ws/tez-runtime-internals/src/test/resources>
[INFO] 
[INFO] --- maven-compiler-plugin:2.3.2:testCompile (default-testCompile) @ tez-runtime-internals
---
[INFO] Nothing to compile - all classes are up to date
[INFO] 
[INFO] --- maven-surefire-plugin:2.14.1:test (default-test) @ tez-runtime-internals ---
[INFO] Skipping execution of surefire because it has already been run for this configuration
[INFO] 
[INFO] --- maven-jar-plugin:2.3.1:jar (default-jar) @ tez-runtime-internals ---
[INFO] Building jar: <https://builds.apache.org/job/Tez-Build/ws/tez-runtime-internals/target/tez-runtime-internals-0.2.0-SNAPSHOT.jar>
[INFO] 
[INFO] --- maven-jar-plugin:2.3.1:test-jar (default) @ tez-runtime-internals ---
[INFO] Building jar: <https://builds.apache.org/job/Tez-Build/ws/tez-runtime-internals/target/tez-runtime-internals-0.2.0-SNAPSHOT-tests.jar>
[INFO] 
[INFO] --- maven-install-plugin:2.3.1:install (default-install) @ tez-runtime-internals ---
[INFO] Installing <https://builds.apache.org/job/Tez-Build/ws/tez-runtime-internals/target/tez-runtime-internals-0.2.0-SNAPSHOT.jar>
to /home/jenkins/.m2/repository/org/apache/tez/tez-runtime-internals/0.2.0-SNAPSHOT/tez-runtime-internals-0.2.0-SNAPSHOT.jar
[INFO] Installing <https://builds.apache.org/job/Tez-Build/ws/tez-runtime-internals/pom.xml>
to /home/jenkins/.m2/repository/org/apache/tez/tez-runtime-internals/0.2.0-SNAPSHOT/tez-runtime-internals-0.2.0-SNAPSHOT.pom
[INFO] Installing <https://builds.apache.org/job/Tez-Build/ws/tez-runtime-internals/target/tez-runtime-internals-0.2.0-SNAPSHOT-tests.jar>
to /home/jenkins/.m2/repository/org/apache/tez/tez-runtime-internals/0.2.0-SNAPSHOT/tez-runtime-internals-0.2.0-SNAPSHOT-tests.jar
[INFO] 
[INFO] --- maven-deploy-plugin:2.7:deploy (default-deploy) @ tez-runtime-internals ---
Downloading: https://repository.apache.org/content/repositories/snapshots/org/apache/tez/tez-runtime-internals/0.2.0-SNAPSHOT/maven-metadata.xml
1001 B      
         
Downloaded: https://repository.apache.org/content/repositories/snapshots/org/apache/tez/tez-runtime-internals/0.2.0-SNAPSHOT/maven-metadata.xml
(1001 B at 1.5 KB/sec)
Uploading: https://repository.apache.org/content/repositories/snapshots/org/apache/tez/tez-runtime-internals/0.2.0-SNAPSHOT/tez-runtime-internals-0.2.0-20131125.195213-91.jar
2/70 KB   
4/70 KB   
6/70 KB   
8/70 KB   
10/70 KB   
12/70 KB   
14/70 KB   
16/70 KB   
18/70 KB   
20/70 KB   
22/70 KB   
24/70 KB   
26/70 KB   
28/70 KB   
30/70 KB   
32/70 KB   
34/70 KB   
36/70 KB   
38/70 KB   
40/70 KB   
42/70 KB   
44/70 KB   
46/70 KB   
48/70 KB   
50/70 KB   
52/70 KB   
54/70 KB   
56/70 KB   
58/70 KB   
60/70 KB   
62/70 KB   
64/70 KB   
66/70 KB   
68/70 KB   
70/70 KB   
           
Uploaded: https://repository.apache.org/content/repositories/snapshots/org/apache/tez/tez-runtime-internals/0.2.0-SNAPSHOT/tez-runtime-internals-0.2.0-20131125.195213-91.jar
(70 KB at 86.6 KB/sec)
Uploading: https://repository.apache.org/content/repositories/snapshots/org/apache/tez/tez-runtime-internals/0.2.0-SNAPSHOT/tez-runtime-internals-0.2.0-20131125.195213-91.pom
2/3 KB     
3/3 KB   
         
Uploaded: https://repository.apache.org/content/repositories/snapshots/org/apache/tez/tez-runtime-internals/0.2.0-SNAPSHOT/tez-runtime-internals-0.2.0-20131125.195213-91.pom
(3 KB at 7.8 KB/sec)
Downloading: https://repository.apache.org/content/repositories/snapshots/org/apache/tez/tez-runtime-internals/maven-metadata.xml
295 B    
        
Downloaded: https://repository.apache.org/content/repositories/snapshots/org/apache/tez/tez-runtime-internals/maven-metadata.xml
(295 B at 1.2 KB/sec)
Uploading: https://repository.apache.org/content/repositories/snapshots/org/apache/tez/tez-runtime-internals/0.2.0-SNAPSHOT/maven-metadata.xml
1001/1001 B   
              
Uploaded: https://repository.apache.org/content/repositories/snapshots/org/apache/tez/tez-runtime-internals/0.2.0-SNAPSHOT/maven-metadata.xml
(1001 B at 3.0 KB/sec)
Uploading: https://repository.apache.org/content/repositories/snapshots/org/apache/tez/tez-runtime-internals/maven-metadata.xml
295/295 B     
            
Uploaded: https://repository.apache.org/content/repositories/snapshots/org/apache/tez/tez-runtime-internals/maven-metadata.xml
(295 B at 0.7 KB/sec)
Uploading: https://repository.apache.org/content/repositories/snapshots/org/apache/tez/tez-runtime-internals/0.2.0-SNAPSHOT/tez-runtime-internals-0.2.0-20131125.195213-91-tests.jar
2/5 KB      
4/5 KB   
5/5 KB   
         
Uploaded: https://repository.apache.org/content/repositories/snapshots/org/apache/tez/tez-runtime-internals/0.2.0-SNAPSHOT/tez-runtime-internals-0.2.0-20131125.195213-91-tests.jar
(5 KB at 12.6 KB/sec)
Uploading: https://repository.apache.org/content/repositories/snapshots/org/apache/tez/tez-runtime-internals/0.2.0-SNAPSHOT/maven-metadata.xml
1001/1001 B   
              
Uploaded: https://repository.apache.org/content/repositories/snapshots/org/apache/tez/tez-runtime-internals/0.2.0-SNAPSHOT/maven-metadata.xml
(1001 B at 2.3 KB/sec)
[INFO] 
[INFO] --- hadoop-maven-plugins:2.2.0:protoc (compile-protoc) @ tez-runtime-internals ---
[INFO] 
[INFO] --- maven-resources-plugin:2.6:resources (default-resources) @ tez-runtime-internals
---
[INFO] Using 'UTF-8' encoding to copy filtered resources.
[INFO] skip non existing resourceDirectory <https://builds.apache.org/job/Tez-Build/ws/tez-runtime-internals/src/main/resources>
[INFO] 
[INFO] --- maven-compiler-plugin:2.3.2:compile (default-compile) @ tez-runtime-internals ---
[WARNING] File encoding has not been set, using platform encoding ISO-8859-1, i.e. build is
platform dependent!
[INFO] Compiling 1 source file to <https://builds.apache.org/job/Tez-Build/ws/tez-runtime-internals/target/classes>
[INFO] 
[INFO] --- maven-resources-plugin:2.6:testResources (default-testResources) @ tez-runtime-internals
---
[INFO] Using 'UTF-8' encoding to copy filtered resources.
[INFO] skip non existing resourceDirectory <https://builds.apache.org/job/Tez-Build/ws/tez-runtime-internals/src/test/resources>
[INFO] 
[INFO] --- maven-compiler-plugin:2.3.2:testCompile (default-testCompile) @ tez-runtime-internals
---
[INFO] Nothing to compile - all classes are up to date
[INFO] 
[INFO] --- maven-surefire-plugin:2.14.1:test (default-test) @ tez-runtime-internals ---
[INFO] Skipping execution of surefire because it has already been run for this configuration
[INFO] 
[INFO] --- maven-jar-plugin:2.3.1:jar (default-jar) @ tez-runtime-internals ---
[INFO] Building jar: <https://builds.apache.org/job/Tez-Build/ws/tez-runtime-internals/target/tez-runtime-internals-0.2.0-SNAPSHOT.jar>
[INFO] 
[INFO] --- maven-jar-plugin:2.3.1:test-jar (default) @ tez-runtime-internals ---
[INFO] Building jar: <https://builds.apache.org/job/Tez-Build/ws/tez-runtime-internals/target/tez-runtime-internals-0.2.0-SNAPSHOT-tests.jar>
[INFO]                                                                         
[INFO] ------------------------------------------------------------------------
[INFO] Building tez-runtime-library 0.2.0-SNAPSHOT
[INFO] ------------------------------------------------------------------------
[INFO] 
[INFO] --- maven-clean-plugin:2.4.1:clean (default-clean) @ tez-runtime-library ---
[INFO] Deleting <https://builds.apache.org/job/Tez-Build/ws/tez-runtime-library/target>
[INFO] 
[INFO] --- hadoop-maven-plugins:2.2.0:protoc (compile-protoc) @ tez-runtime-library ---
[INFO] 
[INFO] --- maven-resources-plugin:2.6:resources (default-resources) @ tez-runtime-library
---
[INFO] Using 'UTF-8' encoding to copy filtered resources.
[INFO] skip non existing resourceDirectory <https://builds.apache.org/job/Tez-Build/ws/tez-runtime-library/src/main/resources>
[INFO] 
[INFO] --- maven-compiler-plugin:2.3.2:compile (default-compile) @ tez-runtime-library ---
[WARNING] File encoding has not been set, using platform encoding ISO-8859-1, i.e. build is
platform dependent!
[INFO] Compiling 77 source files to <https://builds.apache.org/job/Tez-Build/ws/tez-runtime-library/target/classes>
[INFO] 
[INFO] --- maven-resources-plugin:2.6:testResources (default-testResources) @ tez-runtime-library
---
[INFO] Using 'UTF-8' encoding to copy filtered resources.
[INFO] skip non existing resourceDirectory <https://builds.apache.org/job/Tez-Build/ws/tez-runtime-library/src/test/resources>
[INFO] 
[INFO] --- maven-compiler-plugin:2.3.2:testCompile (default-testCompile) @ tez-runtime-library
---
[WARNING] File encoding has not been set, using platform encoding ISO-8859-1, i.e. build is
platform dependent!
[INFO] Compiling 4 source files to <https://builds.apache.org/job/Tez-Build/ws/tez-runtime-library/target/test-classes>
[INFO] 
[INFO] --- maven-surefire-plugin:2.14.1:test (default-test) @ tez-runtime-library ---
[INFO] Surefire report directory: <https://builds.apache.org/job/Tez-Build/ws/tez-runtime-library/target/surefire-reports>

-------------------------------------------------------
 T E S T S
-------------------------------------------------------

-------------------------------------------------------
 T E S T S
-------------------------------------------------------
Running org.apache.tez.runtime.library.broadcast.input.TestBroadcastInputManager
Tests run: 1, Failures: 0, Errors: 0, Skipped: 0, Time elapsed: 0.724 sec
Running org.apache.tez.runtime.library.output.TestOnFileUnorderedKVOutput
Tests run: 1, Failures: 0, Errors: 0, Skipped: 0, Time elapsed: 0.694 sec
Running org.apache.tez.runtime.library.common.sort.impl.TestIFile
Tests run: 4, Failures: 0, Errors: 0, Skipped: 2, Time elapsed: 0.538 sec

Results :

Tests run: 6, Failures: 0, Errors: 0, Skipped: 2

[INFO] 
[INFO] --- hadoop-maven-plugins:2.2.0:protoc (compile-protoc) @ tez-runtime-library ---
[INFO] 
[INFO] --- maven-resources-plugin:2.6:resources (default-resources) @ tez-runtime-library
---
[INFO] Using 'UTF-8' encoding to copy filtered resources.
[INFO] skip non existing resourceDirectory <https://builds.apache.org/job/Tez-Build/ws/tez-runtime-library/src/main/resources>
[INFO] 
[INFO] --- maven-compiler-plugin:2.3.2:compile (default-compile) @ tez-runtime-library ---
[WARNING] File encoding has not been set, using platform encoding ISO-8859-1, i.e. build is
platform dependent!
[INFO] Compiling 1 source file to <https://builds.apache.org/job/Tez-Build/ws/tez-runtime-library/target/classes>
[INFO] 
[INFO] --- maven-resources-plugin:2.6:testResources (default-testResources) @ tez-runtime-library
---
[INFO] Using 'UTF-8' encoding to copy filtered resources.
[INFO] skip non existing resourceDirectory <https://builds.apache.org/job/Tez-Build/ws/tez-runtime-library/src/test/resources>
[INFO] 
[INFO] --- maven-compiler-plugin:2.3.2:testCompile (default-testCompile) @ tez-runtime-library
---
[INFO] Nothing to compile - all classes are up to date
[INFO] 
[INFO] --- maven-surefire-plugin:2.14.1:test (default-test) @ tez-runtime-library ---
[INFO] Skipping execution of surefire because it has already been run for this configuration
[INFO] 
[INFO] --- maven-jar-plugin:2.3.1:jar (default-jar) @ tez-runtime-library ---
[INFO] Building jar: <https://builds.apache.org/job/Tez-Build/ws/tez-runtime-library/target/tez-runtime-library-0.2.0-SNAPSHOT.jar>
[INFO] 
[INFO] --- maven-jar-plugin:2.3.1:test-jar (default) @ tez-runtime-library ---
[INFO] Building jar: <https://builds.apache.org/job/Tez-Build/ws/tez-runtime-library/target/tez-runtime-library-0.2.0-SNAPSHOT-tests.jar>
[INFO] 
[INFO] --- maven-install-plugin:2.3.1:install (default-install) @ tez-runtime-library ---
[INFO] Installing <https://builds.apache.org/job/Tez-Build/ws/tez-runtime-library/target/tez-runtime-library-0.2.0-SNAPSHOT.jar>
to /home/jenkins/.m2/repository/org/apache/tez/tez-runtime-library/0.2.0-SNAPSHOT/tez-runtime-library-0.2.0-SNAPSHOT.jar
[INFO] Installing <https://builds.apache.org/job/Tez-Build/ws/tez-runtime-library/pom.xml>
to /home/jenkins/.m2/repository/org/apache/tez/tez-runtime-library/0.2.0-SNAPSHOT/tez-runtime-library-0.2.0-SNAPSHOT.pom
[INFO] Installing <https://builds.apache.org/job/Tez-Build/ws/tez-runtime-library/target/tez-runtime-library-0.2.0-SNAPSHOT-tests.jar>
to /home/jenkins/.m2/repository/org/apache/tez/tez-runtime-library/0.2.0-SNAPSHOT/tez-runtime-library-0.2.0-SNAPSHOT-tests.jar
[INFO] 
[INFO] --- maven-deploy-plugin:2.7:deploy (default-deploy) @ tez-runtime-library ---
Downloading: https://repository.apache.org/content/repositories/snapshots/org/apache/tez/tez-runtime-library/0.2.0-SNAPSHOT/maven-metadata.xml
              
[WARNING] Could not transfer metadata org.apache.tez:tez-runtime-library:0.2.0-SNAPSHOT/maven-metadata.xml
from/to apache.snapshots.https (https://repository.apache.org/content/repositories/snapshots):
Failed to transfer file: https://repository.apache.org/content/repositories/snapshots/org/apache/tez/tez-runtime-library/0.2.0-SNAPSHOT/maven-metadata.xml.
Return code is: 502, ReasonPhrase:Proxy Error.
[INFO] ------------------------------------------------------------------------
[INFO] Reactor Summary:
[INFO] 
[INFO] tez ............................................... SUCCESS [5.140s]
[INFO] tez-api ........................................... SUCCESS [26.722s]
[INFO] tez-common ........................................ SUCCESS [6.932s]
[INFO] tez-runtime-internals ............................. SUCCESS [9.245s]
[INFO] tez-runtime-library ............................... FAILURE [40.034s]
[INFO] tez-mapreduce ..................................... SKIPPED
[INFO] tez-dag ........................................... SKIPPED
[INFO] tez-mapreduce-examples ............................ SKIPPED
[INFO] tez-tests ......................................... SKIPPED
[INFO] tez-dist .......................................... SKIPPED
[INFO] Tez ............................................... SKIPPED
[INFO] ------------------------------------------------------------------------
[INFO] BUILD FAILURE
[INFO] ------------------------------------------------------------------------
[INFO] Total time: 1:28.422s
[INFO] Finished at: Mon Nov 25 19:52:57 UTC 2013
[INFO] Final Memory: 91M/647M
[INFO] ------------------------------------------------------------------------
[ERROR] Failed to execute goal org.apache.maven.plugins:maven-deploy-plugin:2.7:deploy (default-deploy)
on project tez-runtime-library: Failed to retrieve remote metadata org.apache.tez:tez-runtime-library:0.2.0-SNAPSHOT/maven-metadata.xml:
Could not transfer metadata org.apache.tez:tez-runtime-library:0.2.0-SNAPSHOT/maven-metadata.xml
from/to apache.snapshots.https (https://repository.apache.org/content/repositories/snapshots):
Failed to transfer file: https://repository.apache.org/content/repositories/snapshots/org/apache/tez/tez-runtime-library/0.2.0-SNAPSHOT/maven-metadata.xml.
Return code is: 502, ReasonPhrase:Proxy Error. -> [Help 1]
[ERROR] 
[ERROR] To see the full stack trace of the errors, re-run Maven with the -e switch.
[ERROR] Re-run Maven using the -X switch to enable full debug logging.
[ERROR] 
[ERROR] For more information about the errors and possible solutions, please read the following
articles:
[ERROR] [Help 1] http://cwiki.apache.org/confluence/display/MAVEN/MojoExecutionException
[ERROR] 
[ERROR] After correcting the problems, you can resume the build with the command
[ERROR]   mvn <goals> -rf :tez-runtime-library
Build step 'Execute shell' marked build as failure
Archiving artifacts
Recording test results

Mime
View raw message