tez-dev mailing list archives

Site index · List index
Message view « Date » · « Thread »
Top « Date » · « Thread »
From Apache Jenkins Server <jenk...@builds.apache.org>
Subject Build failed in Jenkins: Tez-Build #193
Date Thu, 07 Nov 2013 19:52:51 GMT
See <https://builds.apache.org/job/Tez-Build/193/changes>

Changes:

[sseth] TEZ-603. Add a temporary configuration to YARNRunner to allow it to kill

------------------------------------------
[...truncated 1044 lines...]
2145 KB   
2149 KB   
2153 KB   
2156 KB   
2160 KB   
2164 KB   
2168 KB   
2172 KB   
2176 KB   
2180 KB   
2184 KB   
2188 KB   
2192 KB   
2196 KB   
2200 KB   
2203 KB   
2207 KB   
2211 KB   
2215 KB   
2219 KB   
2223 KB   
2227 KB   
2231 KB   
2235 KB   
2239 KB   
2242 KB   
2246 KB   
2250 KB   
2254 KB   
2258 KB   
2262 KB   
2266 KB   
2270 KB   
2274 KB   
2278 KB   
2281 KB   
2285 KB   
2289 KB   
2293 KB   
2297 KB   
2301 KB   
2305 KB   
2309 KB   
2313 KB   
2317 KB   
2321 KB   
2325 KB   
2328 KB   
2332 KB   
2336 KB   
2340 KB   
2344 KB   
2348 KB   
2352 KB   
2356 KB   
2360 KB   
2364 KB   
2367 KB   
2371 KB   
2375 KB   
2379 KB   
2383 KB   
2387 KB   
2391 KB   
2395 KB   
2399 KB   
2403 KB   
2406 KB   
2410 KB   
2414 KB   
2418 KB   
2422 KB   
2426 KB   
2430 KB   
2434 KB   
2438 KB   
2442 KB   
2446 KB   
2450 KB   
2453 KB   
2457 KB   
2461 KB   
2465 KB   
2469 KB   
2473 KB   
2477 KB   
2481 KB   
2485 KB   
2489 KB   
2492 KB   
2496 KB   
2500 KB   
2504 KB   
2508 KB   
2512 KB   
2516 KB   
2520 KB   
2524 KB   
2528 KB   
2531 KB   
2535 KB   
2539 KB   
2543 KB   
2547 KB   
2551 KB   
2555 KB   
2559 KB   
2563 KB   
2567 KB   
2571 KB   
2575 KB   
2578 KB   
2582 KB   
2586 KB   
2590 KB   
2594 KB   
2598 KB   
2602 KB   
2606 KB   
2610 KB   
2614 KB   
2617 KB   
2621 KB   
2625 KB   
2629 KB   
2633 KB   
2637 KB   
2641 KB   
2645 KB   
2649 KB   
2653 KB   
2656 KB   
2660 KB   
2664 KB   
2668 KB   
2671 KB   
          
Downloaded: https://repository.apache.org/content/repositories/snapshots/org/apache/hadoop/hadoop-common/3.0.0-SNAPSHOT/hadoop-common-3.0.0-20131107.181244-3650.jar
(2671 KB at 840.1 KB/sec)
[INFO] 
[INFO] --- maven-clean-plugin:2.4.1:clean (default-clean) @ tez-api ---
[INFO] Deleting <https://builds.apache.org/job/Tez-Build/ws/tez-api/target>
[INFO] 
[INFO] --- hadoop-maven-plugins:3.0.0-SNAPSHOT:protoc (compile-protoc) @ tez-api ---
[INFO] 
[INFO] --- maven-resources-plugin:2.6:resources (default-resources) @ tez-api ---
[INFO] Using 'UTF-8' encoding to copy filtered resources.
[INFO] skip non existing resourceDirectory <https://builds.apache.org/job/Tez-Build/ws/tez-api/src/main/resources>
[INFO] 
[INFO] --- maven-compiler-plugin:2.3.2:compile (default-compile) @ tez-api ---
[WARNING] File encoding has not been set, using platform encoding ISO-8859-1, i.e. build is
platform dependent!
[INFO] Compiling 77 source files to <https://builds.apache.org/job/Tez-Build/ws/tez-api/target/classes>
[INFO] 
[INFO] --- maven-resources-plugin:2.6:testResources (default-testResources) @ tez-api ---
[INFO] Using 'UTF-8' encoding to copy filtered resources.
[INFO] skip non existing resourceDirectory <https://builds.apache.org/job/Tez-Build/ws/tez-api/src/test/resources>
[INFO] 
[INFO] --- maven-compiler-plugin:2.3.2:testCompile (default-testCompile) @ tez-api ---
[WARNING] File encoding has not been set, using platform encoding ISO-8859-1, i.e. build is
platform dependent!
[INFO] Compiling 2 source files to <https://builds.apache.org/job/Tez-Build/ws/tez-api/target/test-classes>
[INFO] 
[INFO] --- maven-surefire-plugin:2.14.1:test (default-test) @ tez-api ---
[INFO] Surefire report directory: <https://builds.apache.org/job/Tez-Build/ws/tez-api/target/surefire-reports>

-------------------------------------------------------
 T E S T S
-------------------------------------------------------

-------------------------------------------------------
 T E S T S
-------------------------------------------------------
Running org.apache.tez.dag.api.TestDAGPlan
Tests run: 2, Failures: 0, Errors: 0, Skipped: 0, Time elapsed: 0.367 sec
Running org.apache.tez.dag.api.TestDAGVerify
Tests run: 14, Failures: 0, Errors: 0, Skipped: 0, Time elapsed: 0.266 sec

Results :

Tests run: 16, Failures: 0, Errors: 0, Skipped: 0

[INFO] 
[INFO] --- hadoop-maven-plugins:3.0.0-SNAPSHOT:protoc (compile-protoc) @ tez-api ---
[INFO] 
[INFO] --- maven-resources-plugin:2.6:resources (default-resources) @ tez-api ---
[INFO] Using 'UTF-8' encoding to copy filtered resources.
[INFO] skip non existing resourceDirectory <https://builds.apache.org/job/Tez-Build/ws/tez-api/src/main/resources>
[INFO] 
[INFO] --- maven-compiler-plugin:2.3.2:compile (default-compile) @ tez-api ---
[WARNING] File encoding has not been set, using platform encoding ISO-8859-1, i.e. build is
platform dependent!
[INFO] Compiling 3 source files to <https://builds.apache.org/job/Tez-Build/ws/tez-api/target/classes>
[INFO] 
[INFO] --- maven-resources-plugin:2.6:testResources (default-testResources) @ tez-api ---
[INFO] Using 'UTF-8' encoding to copy filtered resources.
[INFO] skip non existing resourceDirectory <https://builds.apache.org/job/Tez-Build/ws/tez-api/src/test/resources>
[INFO] 
[INFO] --- maven-compiler-plugin:2.3.2:testCompile (default-testCompile) @ tez-api ---
[INFO] Nothing to compile - all classes are up to date
[INFO] 
[INFO] --- maven-surefire-plugin:2.14.1:test (default-test) @ tez-api ---
[INFO] Skipping execution of surefire because it has already been run for this configuration
[INFO] 
[INFO] --- maven-jar-plugin:2.3.1:jar (default-jar) @ tez-api ---
[INFO] Building jar: <https://builds.apache.org/job/Tez-Build/ws/tez-api/target/tez-api-0.2.0-SNAPSHOT.jar>
[INFO] 
[INFO] --- maven-jar-plugin:2.3.1:test-jar (default) @ tez-api ---
[INFO] Building jar: <https://builds.apache.org/job/Tez-Build/ws/tez-api/target/tez-api-0.2.0-SNAPSHOT-tests.jar>
[INFO] 
[INFO] --- maven-install-plugin:2.3.1:install (default-install) @ tez-api ---
[INFO] Installing <https://builds.apache.org/job/Tez-Build/ws/tez-api/target/tez-api-0.2.0-SNAPSHOT.jar>
to /home/jenkins/.m2/repository/org/apache/tez/tez-api/0.2.0-SNAPSHOT/tez-api-0.2.0-SNAPSHOT.jar
[INFO] Installing <https://builds.apache.org/job/Tez-Build/ws/tez-api/pom.xml> to /home/jenkins/.m2/repository/org/apache/tez/tez-api/0.2.0-SNAPSHOT/tez-api-0.2.0-SNAPSHOT.pom
[INFO] Installing <https://builds.apache.org/job/Tez-Build/ws/tez-api/target/tez-api-0.2.0-SNAPSHOT-tests.jar>
to /home/jenkins/.m2/repository/org/apache/tez/tez-api/0.2.0-SNAPSHOT/tez-api-0.2.0-SNAPSHOT-tests.jar
[INFO] 
[INFO] --- maven-deploy-plugin:2.7:deploy (default-deploy) @ tez-api ---
Downloading: https://repository.apache.org/content/repositories/snapshots/org/apache/tez/tez-api/0.2.0-SNAPSHOT/maven-metadata.xml
          
[WARNING] Could not transfer metadata org.apache.tez:tez-api:0.2.0-SNAPSHOT/maven-metadata.xml
from/to apache.snapshots.https (https://repository.apache.org/content/repositories/snapshots):
Error transferring file: Server returned HTTP response code: 502 for URL: https://repository.apache.org/content/repositories/snapshots/org/apache/tez/tez-api/0.2.0-SNAPSHOT/maven-metadata.xml
[INFO] ------------------------------------------------------------------------
[INFO] Reactor Summary:
[INFO] 
[INFO] tez ............................................... SUCCESS [6.414s]
[INFO] tez-api ........................................... FAILURE [31.079s]
[INFO] tez-common ........................................ SKIPPED
[INFO] tez-runtime-internals ............................. SKIPPED
[INFO] tez-runtime-library ............................... SKIPPED
[INFO] tez-mapreduce ..................................... SKIPPED
[INFO] tez-dag ........................................... SKIPPED
[INFO] tez-mapreduce-examples ............................ SKIPPED
[INFO] tez-tests ......................................... SKIPPED
[INFO] tez-dist .......................................... SKIPPED
[INFO] Tez ............................................... SKIPPED
[INFO] ------------------------------------------------------------------------
[INFO] BUILD FAILURE
[INFO] ------------------------------------------------------------------------
[INFO] Total time: 37.790s
[INFO] Finished at: Thu Nov 07 19:51:36 UTC 2013
[INFO] Final Memory: 31M/197M
[INFO] ------------------------------------------------------------------------
[ERROR] Failed to execute goal org.apache.maven.plugins:maven-deploy-plugin:2.7:deploy (default-deploy)
on project tez-api: Failed to retrieve remote metadata org.apache.tez:tez-api:0.2.0-SNAPSHOT/maven-metadata.xml:
Could not transfer metadata org.apache.tez:tez-api:0.2.0-SNAPSHOT/maven-metadata.xml from/to
apache.snapshots.https (https://repository.apache.org/content/repositories/snapshots): Error
transferring file: Server returned HTTP response code: 502 for URL: https://repository.apache.org/content/repositories/snapshots/org/apache/tez/tez-api/0.2.0-SNAPSHOT/maven-metadata.xml
-> [Help 1]
[ERROR] 
[ERROR] To see the full stack trace of the errors, re-run Maven with the -e switch.
[ERROR] Re-run Maven using the -X switch to enable full debug logging.
[ERROR] 
[ERROR] For more information about the errors and possible solutions, please read the following
articles:
[ERROR] [Help 1] http://cwiki.apache.org/confluence/display/MAVEN/MojoExecutionException
[ERROR] 
[ERROR] After correcting the problems, you can resume the build with the command
[ERROR]   mvn <goals> -rf :tez-api
Build step 'Execute shell' marked build as failure
Archiving artifacts
Recording test results

Mime
View raw message