tez-dev mailing list archives

Site index · List index
Message view « Date » · « Thread »
Top « Date » · « Thread »
From Apache Jenkins Server <jenk...@builds.apache.org>
Subject Build failed in Jenkins: Tez-Build #223
Date Fri, 29 Nov 2013 03:08:09 GMT
See <https://builds.apache.org/job/Tez-Build/223/changes>

Changes:

[bikas] TEZ-654. Incorrect target index calculation after auto-reduce parallelism (bikas)

------------------------------------------
[...truncated 957 lines...]
[INFO] Using 'UTF-8' encoding to copy filtered resources.
[INFO] Copying 1 resource
[INFO] 
[INFO] --- maven-compiler-plugin:2.3.2:compile (default-compile) @ tez-mapreduce ---
[WARNING] File encoding has not been set, using platform encoding ISO-8859-1, i.e. build is
platform dependent!
[INFO] Compiling 5 source files to <https://builds.apache.org/job/Tez-Build/ws/tez-mapreduce/target/classes>
[INFO] 
[INFO] --- maven-resources-plugin:2.6:testResources (default-testResources) @ tez-mapreduce
---
[INFO] Using 'UTF-8' encoding to copy filtered resources.
[INFO] Copying 1 resource
[INFO] 
[INFO] --- maven-compiler-plugin:2.3.2:testCompile (default-testCompile) @ tez-mapreduce ---
[INFO] Nothing to compile - all classes are up to date
[INFO] 
[INFO] --- maven-surefire-plugin:2.14.1:test (default-test) @ tez-mapreduce ---
[INFO] Skipping execution of surefire because it has already been run for this configuration
[INFO] 
[INFO] --- maven-jar-plugin:2.3.1:jar (default-jar) @ tez-mapreduce ---
[INFO] Building jar: <https://builds.apache.org/job/Tez-Build/ws/tez-mapreduce/target/tez-mapreduce-0.3.0-SNAPSHOT.jar>
[INFO] 
[INFO] --- maven-jar-plugin:2.3.1:test-jar (default) @ tez-mapreduce ---
[INFO] Building jar: <https://builds.apache.org/job/Tez-Build/ws/tez-mapreduce/target/tez-mapreduce-0.3.0-SNAPSHOT-tests.jar>
[INFO] 
[INFO] --- maven-install-plugin:2.3.1:install (default-install) @ tez-mapreduce ---
[INFO] Installing <https://builds.apache.org/job/Tez-Build/ws/tez-mapreduce/target/tez-mapreduce-0.3.0-SNAPSHOT.jar>
to /home/jenkins/.m2/repository/org/apache/tez/tez-mapreduce/0.3.0-SNAPSHOT/tez-mapreduce-0.3.0-SNAPSHOT.jar
[INFO] Installing <https://builds.apache.org/job/Tez-Build/ws/tez-mapreduce/pom.xml>
to /home/jenkins/.m2/repository/org/apache/tez/tez-mapreduce/0.3.0-SNAPSHOT/tez-mapreduce-0.3.0-SNAPSHOT.pom
[INFO] Installing <https://builds.apache.org/job/Tez-Build/ws/tez-mapreduce/target/tez-mapreduce-0.3.0-SNAPSHOT-tests.jar>
to /home/jenkins/.m2/repository/org/apache/tez/tez-mapreduce/0.3.0-SNAPSHOT/tez-mapreduce-0.3.0-SNAPSHOT-tests.jar
[INFO] 
[INFO] --- maven-deploy-plugin:2.8.1:deploy (default-deploy) @ tez-mapreduce ---
Downloading: https://repository.apache.org/content/repositories/snapshots/org/apache/tez/tez-mapreduce/0.3.0-SNAPSHOT/maven-metadata.xml
989 B   
        
Downloaded: https://repository.apache.org/content/repositories/snapshots/org/apache/tez/tez-mapreduce/0.3.0-SNAPSHOT/maven-metadata.xml
(989 B at 2.1 KB/sec)
Uploading: https://repository.apache.org/content/repositories/snapshots/org/apache/tez/tez-mapreduce/0.3.0-SNAPSHOT/tez-mapreduce-0.3.0-20131129.025220-5.jar
4 KB    
8 KB   
12 KB   
16 KB   
20 KB   
24 KB   
28 KB   
32 KB   
36 KB   
40 KB   
44 KB   
48 KB   
52 KB   
56 KB   
60 KB   
64 KB   
68 KB   
72 KB   
76 KB   
80 KB   
84 KB   
88 KB   
92 KB   
96 KB   
100 KB   
104 KB   
108 KB   
112 KB   
116 KB   
120 KB   
124 KB   
128 KB   
132 KB   
136 KB   
140 KB   
144 KB   
148 KB   
152 KB   
156 KB   
160 KB   
164 KB   
168 KB   
172 KB   
176 KB   
180 KB   
184 KB   
188 KB   
192 KB   
196 KB   
200 KB   
204 KB   
208 KB   
212 KB   
216 KB   
220 KB   
         
Uploaded: https://repository.apache.org/content/repositories/snapshots/org/apache/tez/tez-mapreduce/0.3.0-SNAPSHOT/tez-mapreduce-0.3.0-20131129.025220-5.jar
(220 KB at 446.2 KB/sec)
Uploading: https://repository.apache.org/content/repositories/snapshots/org/apache/tez/tez-mapreduce/0.3.0-SNAPSHOT/tez-mapreduce-0.3.0-20131129.025220-5.pom
4 KB     
5 KB   
       
Uploaded: https://repository.apache.org/content/repositories/snapshots/org/apache/tez/tez-mapreduce/0.3.0-SNAPSHOT/tez-mapreduce-0.3.0-20131129.025220-5.pom
(5 KB at 28.8 KB/sec)
Downloading: https://repository.apache.org/content/repositories/snapshots/org/apache/tez/tez-mapreduce/maven-metadata.xml
387 B   
        
Downloaded: https://repository.apache.org/content/repositories/snapshots/org/apache/tez/tez-mapreduce/maven-metadata.xml
(387 B at 1.7 KB/sec)
Uploading: https://repository.apache.org/content/repositories/snapshots/org/apache/tez/tez-mapreduce/0.3.0-SNAPSHOT/maven-metadata.xml
989 B   
        
Uploaded: https://repository.apache.org/content/repositories/snapshots/org/apache/tez/tez-mapreduce/0.3.0-SNAPSHOT/maven-metadata.xml
(989 B at 4.4 KB/sec)
Uploading: https://repository.apache.org/content/repositories/snapshots/org/apache/tez/tez-mapreduce/maven-metadata.xml
387 B   
        
Uploaded: https://repository.apache.org/content/repositories/snapshots/org/apache/tez/tez-mapreduce/maven-metadata.xml
(387 B at 2.5 KB/sec)
Uploading: https://repository.apache.org/content/repositories/snapshots/org/apache/tez/tez-mapreduce/0.3.0-SNAPSHOT/tez-mapreduce-0.3.0-20131129.025220-5-tests.jar
4 KB    
8 KB   
12 KB   
16 KB   
20 KB   
24 KB   
28 KB   
32 KB   
35 KB   
        
Uploaded: https://repository.apache.org/content/repositories/snapshots/org/apache/tez/tez-mapreduce/0.3.0-SNAPSHOT/tez-mapreduce-0.3.0-20131129.025220-5-tests.jar
(35 KB at 162.5 KB/sec)
Uploading: https://repository.apache.org/content/repositories/snapshots/org/apache/tez/tez-mapreduce/0.3.0-SNAPSHOT/maven-metadata.xml
989 B   
        
Uploaded: https://repository.apache.org/content/repositories/snapshots/org/apache/tez/tez-mapreduce/0.3.0-SNAPSHOT/maven-metadata.xml
(989 B at 7.2 KB/sec)
[INFO] 
[INFO] --- hadoop-maven-plugins:2.2.0:protoc (compile-protoc) @ tez-mapreduce ---
[INFO] 
[INFO] --- maven-resources-plugin:2.6:resources (default-resources) @ tez-mapreduce ---
[INFO] Using 'UTF-8' encoding to copy filtered resources.
[INFO] Copying 1 resource
[INFO] 
[INFO] --- maven-compiler-plugin:2.3.2:compile (default-compile) @ tez-mapreduce ---
[WARNING] File encoding has not been set, using platform encoding ISO-8859-1, i.e. build is
platform dependent!
[INFO] Compiling 5 source files to <https://builds.apache.org/job/Tez-Build/ws/tez-mapreduce/target/classes>
[INFO] 
[INFO] --- maven-resources-plugin:2.6:testResources (default-testResources) @ tez-mapreduce
---
[INFO] Using 'UTF-8' encoding to copy filtered resources.
[INFO] Copying 1 resource
[INFO] 
[INFO] --- maven-compiler-plugin:2.3.2:testCompile (default-testCompile) @ tez-mapreduce ---
[INFO] Nothing to compile - all classes are up to date
[INFO] 
[INFO] --- maven-surefire-plugin:2.14.1:test (default-test) @ tez-mapreduce ---
[INFO] Skipping execution of surefire because it has already been run for this configuration
[INFO] 
[INFO] --- maven-jar-plugin:2.3.1:jar (default-jar) @ tez-mapreduce ---
[INFO] Building jar: <https://builds.apache.org/job/Tez-Build/ws/tez-mapreduce/target/tez-mapreduce-0.3.0-SNAPSHOT.jar>
[INFO] 
[INFO] --- maven-jar-plugin:2.3.1:test-jar (default) @ tez-mapreduce ---
[INFO] Building jar: <https://builds.apache.org/job/Tez-Build/ws/tez-mapreduce/target/tez-mapreduce-0.3.0-SNAPSHOT-tests.jar>
[INFO]                                                                         
[INFO] ------------------------------------------------------------------------
[INFO] Building tez-dag 0.3.0-SNAPSHOT
[INFO] ------------------------------------------------------------------------
[INFO] 
[INFO] --- maven-clean-plugin:2.4.1:clean (default-clean) @ tez-dag ---
[INFO] Deleting <https://builds.apache.org/job/Tez-Build/ws/tez-dag/target>
[INFO] 
[INFO] --- avro-maven-plugin:1.5.3:protocol (default) @ tez-dag ---
[INFO] 
[INFO] --- maven-resources-plugin:2.6:resources (default-resources) @ tez-dag ---
[INFO] Using 'UTF-8' encoding to copy filtered resources.
[INFO] Copying 2 resources
[INFO] 
[INFO] --- maven-compiler-plugin:2.3.2:compile (default-compile) @ tez-dag ---
[WARNING] File encoding has not been set, using platform encoding ISO-8859-1, i.e. build is
platform dependent!
[INFO] Compiling 215 source files to <https://builds.apache.org/job/Tez-Build/ws/tez-dag/target/classes>
[INFO] 
[INFO] --- maven-resources-plugin:2.6:testResources (default-testResources) @ tez-dag ---
[INFO] Using 'UTF-8' encoding to copy filtered resources.
[INFO] Copying 1 resource
[INFO] 
[INFO] --- maven-compiler-plugin:2.3.2:testCompile (default-testCompile) @ tez-dag ---
[WARNING] File encoding has not been set, using platform encoding ISO-8859-1, i.e. build is
platform dependent!
[INFO] Compiling 12 source files to <https://builds.apache.org/job/Tez-Build/ws/tez-dag/target/test-classes>
[INFO] 
[INFO] --- maven-surefire-plugin:2.14.1:test (default-test) @ tez-dag ---
[INFO] Surefire report directory: <https://builds.apache.org/job/Tez-Build/ws/tez-dag/target/surefire-reports>

-------------------------------------------------------
 T E S T S
-------------------------------------------------------

-------------------------------------------------------
 T E S T S
-------------------------------------------------------
Running org.apache.tez.dag.app.rm.TestContainerReuse
Tests run: 5, Failures: 0, Errors: 0, Skipped: 0, Time elapsed: 7.712 sec
Running org.apache.tez.dag.app.rm.container.TestAMContainer
Tests run: 20, Failures: 0, Errors: 0, Skipped: 0, Time elapsed: 1.134 sec
Running org.apache.tez.dag.app.rm.node.TestAMNodeMap
Tests run: 2, Failures: 0, Errors: 0, Skipped: 0, Time elapsed: 0.582 sec
Running org.apache.tez.dag.app.rm.TestTezAMRMClient
Tests run: 1, Failures: 0, Errors: 0, Skipped: 0, Time elapsed: 0.653 sec
Running org.apache.tez.dag.app.rm.TestTaskScheduler
java.lang.OutOfMemoryError: GC overhead limit exceeded
Dumping heap to java_pid22054.hprof ...
Heap dump file created [957039659 bytes in 26.169 secs]
Running org.apache.tez.dag.app.dag.impl.TestDAGImpl
Tests run: 13, Failures: 0, Errors: 0, Skipped: 2, Time elapsed: 2.217 sec
Running org.apache.tez.dag.app.dag.impl.TestTaskAttempt
Tests run: 7, Failures: 0, Errors: 0, Skipped: 0, Time elapsed: 1.535 sec
Running org.apache.tez.dag.app.dag.impl.TestVertexImpl
Tests run: 31, Failures: 0, Errors: 0, Skipped: 1, Time elapsed: 2.977 sec
Running org.apache.tez.dag.app.dag.impl.TestTaskImpl
Tests run: 12, Failures: 0, Errors: 0, Skipped: 0, Time elapsed: 1.25 sec
Running org.apache.tez.dag.app.dag.impl.TestVertexScheduler
Tests run: 2, Failures: 0, Errors: 0, Skipped: 0, Time elapsed: 0.697 sec
Running org.apache.tez.dag.app.dag.impl.TestDAGScheduler
Tests run: 2, Failures: 0, Errors: 0, Skipped: 1, Time elapsed: 0.554 sec

Results :

Tests run: 95, Failures: 0, Errors: 0, Skipped: 4

[INFO] ------------------------------------------------------------------------
[INFO] Reactor Summary:
[INFO] 
[INFO] tez ............................................... SUCCESS [2.911s]
[INFO] tez-api ........................................... SUCCESS [25.515s]
[INFO] tez-common ........................................ SUCCESS [4.299s]
[INFO] tez-runtime-internals ............................. SUCCESS [7.457s]
[INFO] tez-runtime-library ............................... SUCCESS [14.483s]
[INFO] tez-mapreduce ..................................... SUCCESS [23.919s]
[INFO] tez-dag ........................................... FAILURE [15:30.051s]
[INFO] tez-mapreduce-examples ............................ SKIPPED
[INFO] tez-tests ......................................... SKIPPED
[INFO] tez-dist .......................................... SKIPPED
[INFO] Tez ............................................... SKIPPED
[INFO] ------------------------------------------------------------------------
[INFO] BUILD FAILURE
[INFO] ------------------------------------------------------------------------
[INFO] Total time: 16:49.013s
[INFO] Finished at: Fri Nov 29 03:07:54 UTC 2013
[INFO] Final Memory: 139M/591M
[INFO] ------------------------------------------------------------------------
[ERROR] Failed to execute goal org.apache.maven.plugins:maven-surefire-plugin:2.14.1:test
(default-test) on project tez-dag: There was a timeout or other error in the fork -> [Help
1]
[ERROR] 
[ERROR] To see the full stack trace of the errors, re-run Maven with the -e switch.
[ERROR] Re-run Maven using the -X switch to enable full debug logging.
[ERROR] 
[ERROR] For more information about the errors and possible solutions, please read the following
articles:
[ERROR] [Help 1] http://cwiki.apache.org/confluence/display/MAVEN/MojoFailureException
[ERROR] 
[ERROR] After correcting the problems, you can resume the build with the command
[ERROR]   mvn <goals> -rf :tez-dag
Build step 'Execute shell' marked build as failure
Archiving artifacts
Recording test results

Mime
View raw message