tez-dev mailing list archives

Site index · List index
Message view « Date » · « Thread »
Top « Date » · « Thread »
From Apache Jenkins Server <jenk...@builds.apache.org>
Subject Build failed in Jenkins: Tez-Build #238
Date Thu, 12 Dec 2013 21:39:54 GMT
See <https://builds.apache.org/job/Tez-Build/238/changes>

Changes:

[sseth] TEZ-672. Fix Tez specific examples to work on secure clusters. (sseth)

------------------------------------------
[...truncated 1026 lines...]
116 KB   
120 KB   
124 KB   
128 KB   
132 KB   
136 KB   
140 KB   
144 KB   
148 KB   
152 KB   
156 KB   
160 KB   
164 KB   
168 KB   
172 KB   
176 KB   
180 KB   
184 KB   
188 KB   
192 KB   
196 KB   
200 KB   
204 KB   
208 KB   
212 KB   
216 KB   
220 KB   
224 KB   
227 KB   
         
Uploaded: https://repository.apache.org/content/repositories/snapshots/org/apache/tez/tez-mapreduce/0.3.0-SNAPSHOT/tez-mapreduce-0.3.0-20131212.213911-20.jar
(227 KB at 491.9 KB/sec)
Uploading: https://repository.apache.org/content/repositories/snapshots/org/apache/tez/tez-mapreduce/0.3.0-SNAPSHOT/tez-mapreduce-0.3.0-20131212.213911-20.pom
4 KB     
5 KB   
       
Uploaded: https://repository.apache.org/content/repositories/snapshots/org/apache/tez/tez-mapreduce/0.3.0-SNAPSHOT/tez-mapreduce-0.3.0-20131212.213911-20.pom
(5 KB at 34.6 KB/sec)
Downloading: https://repository.apache.org/content/repositories/snapshots/org/apache/tez/tez-mapreduce/maven-metadata.xml
347 B   
        
Downloaded: https://repository.apache.org/content/repositories/snapshots/org/apache/tez/tez-mapreduce/maven-metadata.xml
(347 B at 1.0 KB/sec)
Uploading: https://repository.apache.org/content/repositories/snapshots/org/apache/tez/tez-mapreduce/0.3.0-SNAPSHOT/maven-metadata.xml
993 B   
        
Uploaded: https://repository.apache.org/content/repositories/snapshots/org/apache/tez/tez-mapreduce/0.3.0-SNAPSHOT/maven-metadata.xml
(993 B at 4.0 KB/sec)
Uploading: https://repository.apache.org/content/repositories/snapshots/org/apache/tez/tez-mapreduce/maven-metadata.xml
347 B   
        
Uploaded: https://repository.apache.org/content/repositories/snapshots/org/apache/tez/tez-mapreduce/maven-metadata.xml
(347 B at 2.1 KB/sec)
Uploading: https://repository.apache.org/content/repositories/snapshots/org/apache/tez/tez-mapreduce/0.3.0-SNAPSHOT/tez-mapreduce-0.3.0-20131212.213911-20-tests.jar
4 KB    
8 KB   
12 KB   
16 KB   
20 KB   
24 KB   
28 KB   
32 KB   
36 KB   
        
Uploaded: https://repository.apache.org/content/repositories/snapshots/org/apache/tez/tez-mapreduce/0.3.0-SNAPSHOT/tez-mapreduce-0.3.0-20131212.213911-20-tests.jar
(36 KB at 150.5 KB/sec)
Uploading: https://repository.apache.org/content/repositories/snapshots/org/apache/tez/tez-mapreduce/0.3.0-SNAPSHOT/maven-metadata.xml
993 B   
        
Uploaded: https://repository.apache.org/content/repositories/snapshots/org/apache/tez/tez-mapreduce/0.3.0-SNAPSHOT/maven-metadata.xml
(993 B at 6.5 KB/sec)
[INFO] 
[INFO] --- hadoop-maven-plugins:2.2.0:protoc (compile-protoc) @ tez-mapreduce ---
[INFO] 
[INFO] --- maven-resources-plugin:2.6:resources (default-resources) @ tez-mapreduce ---
[INFO] Using 'UTF-8' encoding to copy filtered resources.
[INFO] Copying 1 resource
[INFO] 
[INFO] --- maven-compiler-plugin:3.1:compile (default-compile) @ tez-mapreduce ---
[INFO] Changes detected - recompiling the module!
[INFO] Compiling 52 source files to <https://builds.apache.org/job/Tez-Build/ws/tez-mapreduce/target/classes>
[WARNING] Note: Some input files use or override a deprecated API.
[WARNING] Note: Recompile with -Xlint:deprecation for details.
[WARNING] Note: <https://builds.apache.org/job/Tez-Build/ws/tez-mapreduce/src/main/java/org/apache/tez/mapreduce/hadoop/mapred/MRCounters.java>
uses unchecked or unsafe operations.
[WARNING] Note: Recompile with -Xlint:unchecked for details.
[INFO] 
[INFO] --- maven-resources-plugin:2.6:testResources (default-testResources) @ tez-mapreduce
---
[INFO] Using 'UTF-8' encoding to copy filtered resources.
[INFO] Copying 1 resource
[INFO] 
[INFO] --- maven-compiler-plugin:3.1:testCompile (default-testCompile) @ tez-mapreduce ---
[INFO] Nothing to compile - all classes are up to date
[INFO] 
[INFO] --- maven-surefire-plugin:2.14.1:test (default-test) @ tez-mapreduce ---
[INFO] Skipping execution of surefire because it has already been run for this configuration
[INFO] 
[INFO] --- maven-jar-plugin:2.3.1:jar (default-jar) @ tez-mapreduce ---
[INFO] Building jar: <https://builds.apache.org/job/Tez-Build/ws/tez-mapreduce/target/tez-mapreduce-0.3.0-SNAPSHOT.jar>
[INFO] 
[INFO] --- maven-jar-plugin:2.3.1:test-jar (default) @ tez-mapreduce ---
[INFO] Building jar: <https://builds.apache.org/job/Tez-Build/ws/tez-mapreduce/target/tez-mapreduce-0.3.0-SNAPSHOT-tests.jar>
[INFO]                                                                         
[INFO] ------------------------------------------------------------------------
[INFO] Building tez-dag 0.3.0-SNAPSHOT
[INFO] ------------------------------------------------------------------------
[INFO] 
[INFO] --- maven-clean-plugin:2.4.1:clean (default-clean) @ tez-dag ---
[INFO] Deleting <https://builds.apache.org/job/Tez-Build/ws/tez-dag/target>
[INFO] 
[INFO] --- avro-maven-plugin:1.5.3:protocol (default) @ tez-dag ---
[INFO] 
[INFO] --- maven-resources-plugin:2.6:resources (default-resources) @ tez-dag ---
[INFO] Using 'UTF-8' encoding to copy filtered resources.
[INFO] Copying 2 resources
[INFO] 
[INFO] --- maven-compiler-plugin:3.1:compile (default-compile) @ tez-dag ---
[INFO] Changes detected - recompiling the module!
[INFO] Compiling 215 source files to <https://builds.apache.org/job/Tez-Build/ws/tez-dag/target/classes>
[WARNING] Note: Some input files use or override a deprecated API.
[WARNING] Note: Recompile with -Xlint:deprecation for details.
[WARNING] Note: <https://builds.apache.org/job/Tez-Build/ws/tez-dag/src/main/java/org/apache/tez/dag/app/speculate/DefaultSpeculator.java>
uses unchecked or unsafe operations.
[WARNING] Note: Recompile with -Xlint:unchecked for details.
[INFO] 
[INFO] --- maven-resources-plugin:2.6:testResources (default-testResources) @ tez-dag ---
[INFO] Using 'UTF-8' encoding to copy filtered resources.
[INFO] Copying 1 resource
[INFO] 
[INFO] --- maven-compiler-plugin:3.1:testCompile (default-testCompile) @ tez-dag ---
[INFO] Changes detected - recompiling the module!
[INFO] Compiling 12 source files to <https://builds.apache.org/job/Tez-Build/ws/tez-dag/target/test-classes>
[WARNING] Note: <https://builds.apache.org/job/Tez-Build/ws/tez-dag/src/test/java/org/apache/tez/dag/app/rm/TestTezAMRMClient.java>
uses unchecked or unsafe operations.
[WARNING] Note: Recompile with -Xlint:unchecked for details.
[INFO] 
[INFO] --- maven-surefire-plugin:2.14.1:test (default-test) @ tez-dag ---
[INFO] Surefire report directory: <https://builds.apache.org/job/Tez-Build/ws/tez-dag/target/surefire-reports>

-------------------------------------------------------
 T E S T S
-------------------------------------------------------

-------------------------------------------------------
 T E S T S
-------------------------------------------------------
Running org.apache.tez.dag.app.rm.TestTaskScheduler
Tests run: 4, Failures: 0, Errors: 0, Skipped: 0, Time elapsed: 1.26 sec
Running org.apache.tez.dag.app.rm.TestTezAMRMClient
Tests run: 1, Failures: 0, Errors: 0, Skipped: 0, Time elapsed: 0.628 sec
Running org.apache.tez.dag.app.rm.container.TestAMContainer
Tests run: 21, Failures: 0, Errors: 0, Skipped: 0, Time elapsed: 1.081 sec
Running org.apache.tez.dag.app.rm.TestContainerReuse
Tests run: 5, Failures: 1, Errors: 0, Skipped: 0, Time elapsed: 7.558 sec <<< FAILURE!
testDelayedReuseContainerBecomesAvailable(org.apache.tez.dag.app.rm.TestContainerReuse)  Time
elapsed: 0.052 sec  <<< FAILURE!
org.mockito.exceptions.verification.WantedButNotInvoked: 
Wanted but not invoked:
taskSchedulerEventHandlerForTest.taskAllocated(
    Mock for TaskAttempt, hashCode: 32215117,
    <any>,
    Container: [ContainerId: container_1_0001_01_000001, NodeId: host1:0, NodeHttpAddress:
host1:0, Resource: <memory:1024, vCores:1>, Priority: 5, Token: null, ]
);
-> at org.apache.tez.dag.app.rm.TestContainerReuse.testDelayedReuseContainerBecomesAvailable(TestContainerReuse.java:186)

However, there were other interactions with this mock:
-> at org.apache.tez.dag.app.rm.TestContainerReuse.testDelayedReuseContainerBecomesAvailable(TestContainerReuse.java:135)
-> at org.apache.tez.dag.app.rm.TestContainerReuse.testDelayedReuseContainerBecomesAvailable(TestContainerReuse.java:135)
-> at org.apache.tez.dag.app.rm.TestContainerReuse.testDelayedReuseContainerBecomesAvailable(TestContainerReuse.java:135)
-> at org.apache.tez.dag.app.rm.TestContainerReuse.testDelayedReuseContainerBecomesAvailable(TestContainerReuse.java:136)
-> at org.apache.tez.dag.app.rm.TestContainerReuse.testDelayedReuseContainerBecomesAvailable(TestContainerReuse.java:136)
-> at org.apache.tez.dag.app.rm.TestContainerReuse.testDelayedReuseContainerBecomesAvailable(TestContainerReuse.java:136)
-> at org.apache.tez.dag.app.rm.TestContainerReuse.testDelayedReuseContainerBecomesAvailable(TestContainerReuse.java:136)
-> at org.apache.tez.dag.app.rm.TestContainerReuse.testDelayedReuseContainerBecomesAvailable(TestContainerReuse.java:138)
-> at org.apache.tez.dag.app.rm.TestContainerReuse.testDelayedReuseContainerBecomesAvailable(TestContainerReuse.java:175)
-> at org.apache.tez.dag.app.rm.TaskSchedulerAppCallbackWrapper$SetApplicationRegistrationDataCallable.call(TaskSchedulerAppCallbackWrapper.java:257)
-> at org.apache.tez.dag.app.rm.TestContainerReuse.testDelayedReuseContainerBecomesAvailable(TestContainerReuse.java:176)

	at org.apache.tez.dag.app.rm.TestContainerReuse.testDelayedReuseContainerBecomesAvailable(TestContainerReuse.java:186)

Running org.apache.tez.dag.app.rm.node.TestAMNodeMap
Tests run: 2, Failures: 0, Errors: 0, Skipped: 0, Time elapsed: 0.534 sec
Running org.apache.tez.dag.app.dag.impl.TestVertexScheduler
Tests run: 2, Failures: 0, Errors: 0, Skipped: 0, Time elapsed: 0.666 sec
Running org.apache.tez.dag.app.dag.impl.TestDAGImpl
Tests run: 13, Failures: 0, Errors: 0, Skipped: 2, Time elapsed: 2.148 sec
Running org.apache.tez.dag.app.dag.impl.TestDAGScheduler
Tests run: 2, Failures: 0, Errors: 0, Skipped: 1, Time elapsed: 0.535 sec
Running org.apache.tez.dag.app.dag.impl.TestTaskAttempt
Tests run: 9, Failures: 0, Errors: 0, Skipped: 0, Time elapsed: 1.512 sec
Running org.apache.tez.dag.app.dag.impl.TestTaskImpl
Tests run: 12, Failures: 0, Errors: 0, Skipped: 0, Time elapsed: 1.207 sec
Running org.apache.tez.dag.app.dag.impl.TestVertexImpl
Tests run: 32, Failures: 0, Errors: 0, Skipped: 1, Time elapsed: 2.99 sec

Results :

Failed tests: 
  TestContainerReuse.testDelayedReuseContainerBecomesAvailable:186 
Wanted but not invoked:
taskSchedulerEventHandlerForTest.taskAllocated(
    Mock for TaskAttempt, hashCode: 32215117,
    <any>,
    Container: [ContainerId: container_1_0001_01_000001, NodeId: host1:0, NodeHttpAddress:
host1:0, Resource: <memory:1024, vCores:1>, Priority: 5, Token: null, ]
);
-> at org.apache.tez.dag.app.rm.TestContainerReuse.testDelayedReuseContainerBecomesAvailable(TestContainerReuse.java:186)

However, there were other interactions with this mock:
-> at org.apache.tez.dag.app.rm.TestContainerReuse.testDelayedReuseContainerBecomesAvailable(TestContainerReuse.java:135)
-> at org.apache.tez.dag.app.rm.TestContainerReuse.testDelayedReuseContainerBecomesAvailable(TestContainerReuse.java:135)
-> at org.apache.tez.dag.app.rm.TestContainerReuse.testDelayedReuseContainerBecomesAvailable(TestContainerReuse.java:135)
-> at org.apache.tez.dag.app.rm.TestContainerReuse.testDelayedReuseContainerBecomesAvailable(TestContainerReuse.java:136)
-> at org.apache.tez.dag.app.rm.TestContainerReuse.testDelayedReuseContainerBecomesAvailable(TestContainerReuse.java:136)
-> at org.apache.tez.dag.app.rm.TestContainerReuse.testDelayedReuseContainerBecomesAvailable(TestContainerReuse.java:136)
-> at org.apache.tez.dag.app.rm.TestContainerReuse.testDelayedReuseContainerBecomesAvailable(TestContainerReuse.java:136)
-> at org.apache.tez.dag.app.rm.TestContainerReuse.testDelayedReuseContainerBecomesAvailable(TestContainerReuse.java:138)
-> at org.apache.tez.dag.app.rm.TestContainerReuse.testDelayedReuseContainerBecomesAvailable(TestContainerReuse.java:175)
-> at org.apache.tez.dag.app.rm.TaskSchedulerAppCallbackWrapper$SetApplicationRegistrationDataCallable.call(TaskSchedulerAppCallbackWrapper.java:257)
-> at org.apache.tez.dag.app.rm.TestContainerReuse.testDelayedReuseContainerBecomesAvailable(TestContainerReuse.java:176)


Tests run: 103, Failures: 1, Errors: 0, Skipped: 4

[INFO] ------------------------------------------------------------------------
[INFO] Reactor Summary:
[INFO] 
[INFO] tez ............................................... SUCCESS [3.333s]
[INFO] tez-api ........................................... SUCCESS [21.571s]
[INFO] tez-common ........................................ SUCCESS [2.954s]
[INFO] tez-runtime-internals ............................. SUCCESS [3.876s]
[INFO] tez-runtime-library ............................... SUCCESS [7.760s]
[INFO] tez-mapreduce ..................................... SUCCESS [18.147s]
[INFO] tez-dag ........................................... FAILURE [26.040s]
[INFO] tez-mapreduce-examples ............................ SKIPPED
[INFO] tez-tests ......................................... SKIPPED
[INFO] tez-dist .......................................... SKIPPED
[INFO] Tez ............................................... SKIPPED
[INFO] ------------------------------------------------------------------------
[INFO] BUILD FAILURE
[INFO] ------------------------------------------------------------------------
[INFO] Total time: 1:24.001s
[INFO] Finished at: Thu Dec 12 21:39:39 UTC 2013
[INFO] Final Memory: 25M/325M
[INFO] ------------------------------------------------------------------------
[ERROR] Failed to execute goal org.apache.maven.plugins:maven-surefire-plugin:2.14.1:test
(default-test) on project tez-dag: There are test failures.
[ERROR] 
[ERROR] Please refer to <https://builds.apache.org/job/Tez-Build/ws/tez-dag/target/surefire-reports>
for the individual test results.
[ERROR] -> [Help 1]
[ERROR] 
[ERROR] To see the full stack trace of the errors, re-run Maven with the -e switch.
[ERROR] Re-run Maven using the -X switch to enable full debug logging.
[ERROR] 
[ERROR] For more information about the errors and possible solutions, please read the following
articles:
[ERROR] [Help 1] http://cwiki.apache.org/confluence/display/MAVEN/MojoFailureException
[ERROR] 
[ERROR] After correcting the problems, you can resume the build with the command
[ERROR]   mvn <goals> -rf :tez-dag
Build step 'Execute shell' marked build as failure
Archiving artifacts
Recording test results

Mime
View raw message