tez-dev mailing list archives

Site index · List index
Message view « Date » · « Thread »
Top « Date » · « Thread »
From Apache Jenkins Server <jenk...@builds.apache.org>
Subject Build failed in Jenkins: Tez-Build #248
Date Thu, 09 Jan 2014 04:06:36 GMT
See <https://builds.apache.org/job/Tez-Build/248/changes>

Changes:

[sseth] TEZ-713. Fix typo in compression property name. (sseth)

------------------------------------------
[...truncated 1540 lines...]
        
Downloaded: https://repository.apache.org/content/repositories/snapshots/org/apache/tez/tez-mapreduce-examples/0.3.0-SNAPSHOT/maven-metadata.xml
(998 B at 0.5 KB/sec)
Uploading: https://repository.apache.org/content/repositories/snapshots/org/apache/tez/tez-mapreduce-examples/0.3.0-SNAPSHOT/tez-mapreduce-examples-0.3.0-20140109.035056-9.jar
2/183 KB   
4/183 KB   
6/183 KB   
8/183 KB   
10/183 KB   
12/183 KB   
14/183 KB   
16/183 KB   
18/183 KB   
20/183 KB   
22/183 KB   
24/183 KB   
26/183 KB   
28/183 KB   
30/183 KB   
32/183 KB   
34/183 KB   
36/183 KB   
38/183 KB   
40/183 KB   
42/183 KB   
44/183 KB   
46/183 KB   
48/183 KB   
50/183 KB   
52/183 KB   
54/183 KB   
56/183 KB   
58/183 KB   
60/183 KB   
62/183 KB   
64/183 KB   
66/183 KB   
68/183 KB   
70/183 KB   
72/183 KB   
74/183 KB   
76/183 KB   
78/183 KB   
80/183 KB   
82/183 KB   
84/183 KB   
86/183 KB   
88/183 KB   
90/183 KB   
92/183 KB   
94/183 KB   
96/183 KB   
98/183 KB   
100/183 KB   
102/183 KB   
104/183 KB   
106/183 KB   
108/183 KB   
110/183 KB   
112/183 KB   
114/183 KB   
116/183 KB   
118/183 KB   
120/183 KB   
122/183 KB   
124/183 KB   
126/183 KB   
128/183 KB   
130/183 KB   
132/183 KB   
134/183 KB   
136/183 KB   
138/183 KB   
140/183 KB   
142/183 KB   
144/183 KB   
146/183 KB   
148/183 KB   
150/183 KB   
152/183 KB   
154/183 KB   
156/183 KB   
158/183 KB   
160/183 KB   
162/183 KB   
164/183 KB   
166/183 KB   
168/183 KB   
170/183 KB   
172/183 KB   
174/183 KB   
176/183 KB   
178/183 KB   
180/183 KB   
182/183 KB   
183/183 KB   
             
Uploaded: https://repository.apache.org/content/repositories/snapshots/org/apache/tez/tez-mapreduce-examples/0.3.0-SNAPSHOT/tez-mapreduce-examples-0.3.0-20140109.035056-9.jar
(183 KB at 212.2 KB/sec)
Uploading: https://repository.apache.org/content/repositories/snapshots/org/apache/tez/tez-mapreduce-examples/0.3.0-SNAPSHOT/tez-mapreduce-examples-0.3.0-20140109.035056-9.pom
2/3 KB       
3/3 KB   
         
Uploaded: https://repository.apache.org/content/repositories/snapshots/org/apache/tez/tez-mapreduce-examples/0.3.0-SNAPSHOT/tez-mapreduce-examples-0.3.0-20140109.035056-9.pom
(3 KB at 6.0 KB/sec)
Downloading: https://repository.apache.org/content/repositories/snapshots/org/apache/tez/tez-mapreduce-examples/maven-metadata.xml
336 B    
        
Downloaded: https://repository.apache.org/content/repositories/snapshots/org/apache/tez/tez-mapreduce-examples/maven-metadata.xml
(336 B at 1.0 KB/sec)
Uploading: https://repository.apache.org/content/repositories/snapshots/org/apache/tez/tez-mapreduce-examples/0.3.0-SNAPSHOT/maven-metadata.xml
998/998 B   
            
Uploaded: https://repository.apache.org/content/repositories/snapshots/org/apache/tez/tez-mapreduce-examples/0.3.0-SNAPSHOT/maven-metadata.xml
(998 B at 1.1 KB/sec)
Uploading: https://repository.apache.org/content/repositories/snapshots/org/apache/tez/tez-mapreduce-examples/maven-metadata.xml
336/336 B   
            
Uploaded: https://repository.apache.org/content/repositories/snapshots/org/apache/tez/tez-mapreduce-examples/maven-metadata.xml
(336 B at 0.1 KB/sec)
Uploading: https://repository.apache.org/content/repositories/snapshots/org/apache/tez/tez-mapreduce-examples/0.3.0-SNAPSHOT/tez-mapreduce-examples-0.3.0-20140109.035056-9-tests.jar
2/5 KB      
4/5 KB   
5/5 KB   
         
Uploaded: https://repository.apache.org/content/repositories/snapshots/org/apache/tez/tez-mapreduce-examples/0.3.0-SNAPSHOT/tez-mapreduce-examples-0.3.0-20140109.035056-9-tests.jar
(5 KB at 9.2 KB/sec)
Uploading: https://repository.apache.org/content/repositories/snapshots/org/apache/tez/tez-mapreduce-examples/0.3.0-SNAPSHOT/maven-metadata.xml
998/998 B   
            
Uploaded: https://repository.apache.org/content/repositories/snapshots/org/apache/tez/tez-mapreduce-examples/0.3.0-SNAPSHOT/maven-metadata.xml
(998 B at 1.8 KB/sec)
[INFO] 
[INFO] --- maven-resources-plugin:2.6:resources (default-resources) @ tez-mapreduce-examples
---
[INFO] Using 'UTF-8' encoding to copy filtered resources.
[INFO] skip non existing resourceDirectory <https://builds.apache.org/job/Tez-Build/ws/tez-mapreduce-examples/src/main/resources>
[INFO] 
[INFO] --- maven-compiler-plugin:3.1:compile (default-compile) @ tez-mapreduce-examples ---
[INFO] Nothing to compile - all classes are up to date
[INFO] 
[INFO] --- maven-resources-plugin:2.6:testResources (default-testResources) @ tez-mapreduce-examples
---
[INFO] Using 'UTF-8' encoding to copy filtered resources.
[INFO] skip non existing resourceDirectory <https://builds.apache.org/job/Tez-Build/ws/tez-mapreduce-examples/src/test/resources>
[INFO] 
[INFO] --- maven-compiler-plugin:3.1:testCompile (default-testCompile) @ tez-mapreduce-examples
---
[INFO] Nothing to compile - all classes are up to date
[INFO] 
[INFO] --- maven-surefire-plugin:2.14.1:test (default-test) @ tez-mapreduce-examples ---
[INFO] Skipping execution of surefire because it has already been run for this configuration
[INFO] 
[INFO] --- maven-jar-plugin:2.3.1:jar (default-jar) @ tez-mapreduce-examples ---
[INFO] Building jar: <https://builds.apache.org/job/Tez-Build/ws/tez-mapreduce-examples/target/tez-mapreduce-examples-0.3.0-SNAPSHOT.jar>
[INFO] 
[INFO] --- maven-jar-plugin:2.3.1:test-jar (default) @ tez-mapreduce-examples ---
[INFO] Building jar: <https://builds.apache.org/job/Tez-Build/ws/tez-mapreduce-examples/target/tez-mapreduce-examples-0.3.0-SNAPSHOT-tests.jar>
[INFO]                                                                         
[INFO] ------------------------------------------------------------------------
[INFO] Building tez-dag 0.3.0-SNAPSHOT
[INFO] ------------------------------------------------------------------------
[INFO] 
[INFO] --- maven-clean-plugin:2.4.1:clean (default-clean) @ tez-dag ---
[INFO] Deleting <https://builds.apache.org/job/Tez-Build/ws/tez-dag/target>
[INFO] 
[INFO] --- avro-maven-plugin:1.5.3:protocol (default) @ tez-dag ---
[INFO] 
[INFO] --- maven-resources-plugin:2.6:resources (default-resources) @ tez-dag ---
[INFO] Using 'UTF-8' encoding to copy filtered resources.
[INFO] Copying 2 resources
[INFO] 
[INFO] --- maven-compiler-plugin:3.1:compile (default-compile) @ tez-dag ---
[INFO] Changes detected - recompiling the module!
[INFO] Compiling 212 source files to <https://builds.apache.org/job/Tez-Build/ws/tez-dag/target/classes>
[WARNING] Note: Some input files use or override a deprecated API.
[WARNING] Note: Recompile with -Xlint:deprecation for details.
[WARNING] Note: <https://builds.apache.org/job/Tez-Build/ws/tez-dag/src/main/java/org/apache/tez/dag/app/speculate/DefaultSpeculator.java>
uses unchecked or unsafe operations.
[WARNING] Note: Recompile with -Xlint:unchecked for details.
[INFO] 
[INFO] --- maven-resources-plugin:2.6:testResources (default-testResources) @ tez-dag ---
[INFO] Using 'UTF-8' encoding to copy filtered resources.
[INFO] Copying 1 resource
[INFO] 
[INFO] --- maven-compiler-plugin:3.1:testCompile (default-testCompile) @ tez-dag ---
[INFO] Changes detected - recompiling the module!
[INFO] Compiling 12 source files to <https://builds.apache.org/job/Tez-Build/ws/tez-dag/target/test-classes>
[WARNING] Note: Some input files use unchecked or unsafe operations.
[WARNING] Note: Recompile with -Xlint:unchecked for details.
[INFO] 
[INFO] --- maven-surefire-plugin:2.14.1:test (default-test) @ tez-dag ---
[INFO] Surefire report directory: <https://builds.apache.org/job/Tez-Build/ws/tez-dag/target/surefire-reports>

-------------------------------------------------------
 T E S T S
-------------------------------------------------------

-------------------------------------------------------
 T E S T S
-------------------------------------------------------
Running org.apache.tez.dag.app.rm.container.TestAMContainer
Tests run: 22, Failures: 0, Errors: 0, Skipped: 0, Time elapsed: 1.032 sec
Running org.apache.tez.dag.app.rm.TestContainerReuse
Tests run: 6, Failures: 0, Errors: 0, Skipped: 0, Time elapsed: 10.776 sec
Running org.apache.tez.dag.app.rm.TestTaskScheduler
Tests run: 4, Failures: 0, Errors: 0, Skipped: 0, Time elapsed: 1.374 sec
Running org.apache.tez.dag.app.rm.node.TestAMNodeMap
Tests run: 2, Failures: 0, Errors: 0, Skipped: 0, Time elapsed: 0.506 sec
Running org.apache.tez.dag.app.rm.TestTezAMRMClient
Tests run: 1, Failures: 0, Errors: 0, Skipped: 0, Time elapsed: 0.601 sec
Running org.apache.tez.dag.app.dag.impl.TestTaskAttempt
Tests run: 9, Failures: 0, Errors: 0, Skipped: 0, Time elapsed: 1.554 sec
Running org.apache.tez.dag.app.dag.impl.TestTaskImpl
Tests run: 12, Failures: 0, Errors: 0, Skipped: 0, Time elapsed: 1.131 sec
Running org.apache.tez.dag.app.dag.impl.TestVertexManager
Tests run: 2, Failures: 0, Errors: 0, Skipped: 0, Time elapsed: 0.642 sec
Running org.apache.tez.dag.app.dag.impl.TestVertexImpl
Tests run: 34, Failures: 0, Errors: 0, Skipped: 1, Time elapsed: 2.382 sec
Running org.apache.tez.dag.app.dag.impl.TestDAGScheduler
Tests run: 2, Failures: 0, Errors: 0, Skipped: 1, Time elapsed: 0.51 sec
Running org.apache.tez.dag.app.dag.impl.TestDAGImpl

Results :

Tests run: 94, Failures: 0, Errors: 0, Skipped: 2

[INFO] ------------------------------------------------------------------------
[INFO] Reactor Summary:
[INFO] 
[INFO] tez ............................................... SUCCESS [4.439s]
[INFO] tez-api ........................................... SUCCESS [22.914s]
[INFO] tez-common ........................................ SUCCESS [7.376s]
[INFO] tez-runtime-internals ............................. SUCCESS [8.109s]
[INFO] tez-runtime-library ............................... SUCCESS [9.553s]
[INFO] tez-mapreduce ..................................... SUCCESS [18.143s]
[INFO] tez-mapreduce-examples ............................ SUCCESS [9.452s]
[INFO] tez-dag ........................................... FAILURE [15:24.886s]
[INFO] tez-tests ......................................... SKIPPED
[INFO] tez-dist .......................................... SKIPPED
[INFO] Tez ............................................... SKIPPED
[INFO] ------------------------------------------------------------------------
[INFO] BUILD FAILURE
[INFO] ------------------------------------------------------------------------
[INFO] Total time: 16:45.213s
[INFO] Finished at: Thu Jan 09 04:06:28 UTC 2014
[INFO] Final Memory: 28M/571M
[INFO] ------------------------------------------------------------------------
[ERROR] Failed to execute goal org.apache.maven.plugins:maven-surefire-plugin:2.14.1:test
(default-test) on project tez-dag: There was a timeout or other error in the fork -> [Help
1]
[ERROR] 
[ERROR] To see the full stack trace of the errors, re-run Maven with the -e switch.
[ERROR] Re-run Maven using the -X switch to enable full debug logging.
[ERROR] 
[ERROR] For more information about the errors and possible solutions, please read the following
articles:
[ERROR] [Help 1] http://cwiki.apache.org/confluence/display/MAVEN/MojoFailureException
[ERROR] 
[ERROR] After correcting the problems, you can resume the build with the command
[ERROR]   mvn <goals> -rf :tez-dag
Build step 'Execute shell' marked build as failure
Archiving artifacts
Recording test results

Mime
View raw message