tez-dev mailing list archives

Site index · List index
Message view « Date » · « Thread »
Top « Date » · « Thread »
From Apache Jenkins Server <jenk...@builds.apache.org>
Subject Build failed in Jenkins: Tez-Build #254
Date Mon, 13 Jan 2014 20:51:08 GMT
See <https://builds.apache.org/job/Tez-Build/254/changes>

Changes:

[sseth] TEZ-725. Allow profiling of specific containers. (sseth)

------------------------------------------
[...truncated 1541 lines...]
	at org.junit.Assert.fail(Assert.java:88)
	at org.junit.Assert.failNotEquals(Assert.java:743)
	at org.junit.Assert.assertEquals(Assert.java:118)
	at org.junit.Assert.assertEquals(Assert.java:144)
	at org.apache.tez.dag.app.dag.impl.TestVertexImpl.initAllVertices(TestVertexImpl.java:1175)
	at org.apache.tez.dag.app.dag.impl.TestVertexImpl.testVertexManagerInit(TestVertexImpl.java:1473)

testVertexCommitterInit(org.apache.tez.dag.app.dag.impl.TestVertexImpl)  Time elapsed: 0.023
sec  <<< FAILURE!
java.lang.AssertionError: expected:<INITED> but was:<NEW>
	at org.junit.Assert.fail(Assert.java:88)
	at org.junit.Assert.failNotEquals(Assert.java:743)
	at org.junit.Assert.assertEquals(Assert.java:118)
	at org.junit.Assert.assertEquals(Assert.java:144)
	at org.apache.tez.dag.app.dag.impl.TestVertexImpl.initAllVertices(TestVertexImpl.java:1175)
	at org.apache.tez.dag.app.dag.impl.TestVertexImpl.testVertexCommitterInit(TestVertexImpl.java:1462)

testVertexKillPending(org.apache.tez.dag.app.dag.impl.TestVertexImpl)  Time elapsed: 0.024
sec  <<< FAILURE!
java.lang.AssertionError: expected:<INITED> but was:<NEW>
	at org.junit.Assert.fail(Assert.java:88)
	at org.junit.Assert.failNotEquals(Assert.java:743)
	at org.junit.Assert.assertEquals(Assert.java:118)
	at org.junit.Assert.assertEquals(Assert.java:144)
	at org.apache.tez.dag.app.dag.impl.TestVertexImpl.initAllVertices(TestVertexImpl.java:1175)
	at org.apache.tez.dag.app.dag.impl.TestVertexImpl.testVertexKillPending(TestVertexImpl.java:1392)

testBadCommitter(org.apache.tez.dag.app.dag.impl.TestVertexImpl)  Time elapsed: 0.031 sec
 <<< FAILURE!
java.lang.AssertionError: expected:<INITED> but was:<NEW>
	at org.junit.Assert.fail(Assert.java:88)
	at org.junit.Assert.failNotEquals(Assert.java:743)
	at org.junit.Assert.assertEquals(Assert.java:118)
	at org.junit.Assert.assertEquals(Assert.java:144)
	at org.apache.tez.dag.app.dag.impl.TestVertexImpl.initAllVertices(TestVertexImpl.java:1175)
	at org.apache.tez.dag.app.dag.impl.TestVertexImpl.testBadCommitter(TestVertexImpl.java:1789)

testDAGEventGeneration(org.apache.tez.dag.app.dag.impl.TestVertexImpl)  Time elapsed: 0.024
sec  <<< FAILURE!
java.lang.AssertionError: expected:<INITED> but was:<NEW>
	at org.junit.Assert.fail(Assert.java:88)
	at org.junit.Assert.failNotEquals(Assert.java:743)
	at org.junit.Assert.assertEquals(Assert.java:118)
	at org.junit.Assert.assertEquals(Assert.java:144)
	at org.apache.tez.dag.app.dag.impl.TestVertexImpl.initAllVertices(TestVertexImpl.java:1175)
	at org.apache.tez.dag.app.dag.impl.TestVertexImpl.testDAGEventGeneration(TestVertexImpl.java:1596)

testVertexWithInitializerSuccess(org.apache.tez.dag.app.dag.impl.TestVertexImpl)  Time elapsed:
0.04 sec  <<< FAILURE!
java.lang.AssertionError: expected:<INITIALIZING> but was:<NEW>
	at org.junit.Assert.fail(Assert.java:88)
	at org.junit.Assert.failNotEquals(Assert.java:743)
	at org.junit.Assert.assertEquals(Assert.java:118)
	at org.junit.Assert.assertEquals(Assert.java:144)
	at org.apache.tez.dag.app.dag.impl.TestVertexImpl.testVertexWithInitializerSuccess(TestVertexImpl.java:1960)

testVertexTaskFailure(org.apache.tez.dag.app.dag.impl.TestVertexImpl)  Time elapsed: 0.024
sec  <<< FAILURE!
java.lang.AssertionError: expected:<INITED> but was:<NEW>
	at org.junit.Assert.fail(Assert.java:88)
	at org.junit.Assert.failNotEquals(Assert.java:743)
	at org.junit.Assert.assertEquals(Assert.java:118)
	at org.junit.Assert.assertEquals(Assert.java:144)
	at org.apache.tez.dag.app.dag.impl.TestVertexImpl.initAllVertices(TestVertexImpl.java:1175)
	at org.apache.tez.dag.app.dag.impl.TestVertexImpl.testVertexTaskFailure(TestVertexImpl.java:1486)

testInitStartRace(org.apache.tez.dag.app.dag.impl.TestVertexImpl)  Time elapsed: 0.042 sec
 <<< FAILURE!
java.lang.AssertionError: expected:<RUNNING> but was:<ERROR>
	at org.junit.Assert.fail(Assert.java:88)
	at org.junit.Assert.failNotEquals(Assert.java:743)
	at org.junit.Assert.assertEquals(Assert.java:118)
	at org.junit.Assert.assertEquals(Assert.java:144)
	at org.apache.tez.dag.app.dag.impl.TestVertexImpl.testInitStartRace(TestVertexImpl.java:2131)

testVertexWithInitializerFailure(org.apache.tez.dag.app.dag.impl.TestVertexImpl)  Time elapsed:
0.038 sec  <<< FAILURE!
java.lang.AssertionError: expected:<INITIALIZING> but was:<NEW>
	at org.junit.Assert.fail(Assert.java:88)
	at org.junit.Assert.failNotEquals(Assert.java:743)
	at org.junit.Assert.assertEquals(Assert.java:118)
	at org.junit.Assert.assertEquals(Assert.java:144)
	at org.apache.tez.dag.app.dag.impl.TestVertexImpl.testVertexWithInitializerFailure(TestVertexImpl.java:1927)

testVertexKillDiagnostics(org.apache.tez.dag.app.dag.impl.TestVertexImpl)  Time elapsed: 0.029
sec  <<< FAILURE!
java.lang.AssertionError: expected:<INITED> but was:<NEW>
	at org.junit.Assert.fail(Assert.java:88)
	at org.junit.Assert.failNotEquals(Assert.java:743)
	at org.junit.Assert.assertEquals(Assert.java:118)
	at org.junit.Assert.assertEquals(Assert.java:144)
	at org.apache.tez.dag.app.dag.impl.TestVertexImpl.initAllVertices(TestVertexImpl.java:1175)
	at org.apache.tez.dag.app.dag.impl.TestVertexImpl.testVertexKillDiagnostics(TestVertexImpl.java:1370)

Running org.apache.tez.dag.app.dag.impl.TestDAGScheduler
Tests run: 2, Failures: 0, Errors: 0, Skipped: 1, Time elapsed: 0.509 sec
Running org.apache.tez.dag.app.dag.impl.TestTaskImpl
Tests run: 12, Failures: 0, Errors: 0, Skipped: 0, Time elapsed: 1.121 sec
Running org.apache.tez.dag.app.dag.impl.TestDAGImpl
Tests run: 13, Failures: 7, Errors: 0, Skipped: 2, Time elapsed: 1.607 sec <<< FAILURE!
testVertexReRunning(org.apache.tez.dag.app.dag.impl.TestDAGImpl)  Time elapsed: 1.117 sec
 <<< FAILURE!
java.lang.AssertionError: expected:<RUNNING> but was:<ERROR>
	at org.junit.Assert.fail(Assert.java:88)
	at org.junit.Assert.failNotEquals(Assert.java:743)
	at org.junit.Assert.assertEquals(Assert.java:118)
	at org.junit.Assert.assertEquals(Assert.java:144)
	at org.apache.tez.dag.app.dag.impl.TestDAGImpl.startDAG(TestDAGImpl.java:549)
	at org.apache.tez.dag.app.dag.impl.TestDAGImpl.testVertexReRunning(TestDAGImpl.java:610)

testDAGStart(org.apache.tez.dag.app.dag.impl.TestDAGImpl)  Time elapsed: 0.042 sec  <<<
FAILURE!
java.lang.AssertionError: expected:<RUNNING> but was:<ERROR>
	at org.junit.Assert.fail(Assert.java:88)
	at org.junit.Assert.failNotEquals(Assert.java:743)
	at org.junit.Assert.assertEquals(Assert.java:118)
	at org.junit.Assert.assertEquals(Assert.java:144)
	at org.apache.tez.dag.app.dag.impl.TestDAGImpl.startDAG(TestDAGImpl.java:549)
	at org.apache.tez.dag.app.dag.impl.TestDAGImpl.testDAGStart(TestDAGImpl.java:561)

testVertexCompletion(org.apache.tez.dag.app.dag.impl.TestDAGImpl)  Time elapsed: 0.04 sec
 <<< FAILURE!
java.lang.AssertionError: expected:<RUNNING> but was:<ERROR>
	at org.junit.Assert.fail(Assert.java:88)
	at org.junit.Assert.failNotEquals(Assert.java:743)
	at org.junit.Assert.assertEquals(Assert.java:118)
	at org.junit.Assert.assertEquals(Assert.java:144)
	at org.apache.tez.dag.app.dag.impl.TestDAGImpl.startDAG(TestDAGImpl.java:549)
	at org.apache.tez.dag.app.dag.impl.TestDAGImpl.testVertexCompletion(TestDAGImpl.java:590)

testVertexFailureHandling(org.apache.tez.dag.app.dag.impl.TestDAGImpl)  Time elapsed: 0.038
sec  <<< FAILURE!
java.lang.AssertionError: expected:<RUNNING> but was:<ERROR>
	at org.junit.Assert.fail(Assert.java:88)
	at org.junit.Assert.failNotEquals(Assert.java:743)
	at org.junit.Assert.assertEquals(Assert.java:118)
	at org.junit.Assert.assertEquals(Assert.java:144)
	at org.apache.tez.dag.app.dag.impl.TestDAGImpl.startDAG(TestDAGImpl.java:549)
	at org.apache.tez.dag.app.dag.impl.TestDAGImpl.testVertexFailureHandling(TestDAGImpl.java:743)

testDAGKill(org.apache.tez.dag.app.dag.impl.TestDAGImpl)  Time elapsed: 0.04 sec  <<<
FAILURE!
java.lang.AssertionError: expected:<RUNNING> but was:<ERROR>
	at org.junit.Assert.fail(Assert.java:88)
	at org.junit.Assert.failNotEquals(Assert.java:743)
	at org.junit.Assert.assertEquals(Assert.java:118)
	at org.junit.Assert.assertEquals(Assert.java:144)
	at org.apache.tez.dag.app.dag.impl.TestDAGImpl.startDAG(TestDAGImpl.java:549)
	at org.apache.tez.dag.app.dag.impl.TestDAGImpl.testDAGKill(TestDAGImpl.java:778)

testDAGKillPending(org.apache.tez.dag.app.dag.impl.TestDAGImpl)  Time elapsed: 0.031 sec 
<<< FAILURE!
java.lang.AssertionError: expected:<RUNNING> but was:<ERROR>
	at org.junit.Assert.fail(Assert.java:88)
	at org.junit.Assert.failNotEquals(Assert.java:743)
	at org.junit.Assert.assertEquals(Assert.java:118)
	at org.junit.Assert.assertEquals(Assert.java:144)
	at org.apache.tez.dag.app.dag.impl.TestDAGImpl.startDAG(TestDAGImpl.java:549)
	at org.apache.tez.dag.app.dag.impl.TestDAGImpl.testDAGKillPending(TestDAGImpl.java:809)

testKillRunningDAG(org.apache.tez.dag.app.dag.impl.TestDAGImpl)  Time elapsed: 0.027 sec 
<<< FAILURE!
java.lang.AssertionError: expected:<RUNNING> but was:<ERROR>
	at org.junit.Assert.fail(Assert.java:88)
	at org.junit.Assert.failNotEquals(Assert.java:743)
	at org.junit.Assert.assertEquals(Assert.java:118)
	at org.junit.Assert.assertEquals(Assert.java:144)
	at org.apache.tez.dag.app.dag.impl.TestDAGImpl.startDAG(TestDAGImpl.java:549)
	at org.apache.tez.dag.app.dag.impl.TestDAGImpl.testKillRunningDAG(TestDAGImpl.java:669)


Results :

Failed tests: 
  TestTaskScheduler.testTaskSchedulerWithReuse:605 
Wanted but not invoked:
taskSchedulerAppCallback.taskAllocated(
    Mock for ClassWithSuperclassToWorkAroundCglibBug, hashCode: 14222419,
    Mock for ClassWithSuperclassToWorkAroundCglibBug, hashCode: 29071960,
    Mock for Container, hashCode: 26357574
);
-> at org.apache.tez.dag.app.rm.TestTaskScheduler.testTaskSchedulerWithReuse(TestTaskScheduler.java:605)

However, there were other interactions with this mock:
-> at org.apache.tez.dag.app.rm.TaskSchedulerAppCallbackWrapper$SetApplicationRegistrationDataCallable.call(TaskSchedulerAppCallbackWrapper.java:257)
-> at org.apache.tez.dag.app.rm.TaskSchedulerAppCallbackWrapper$TaskAllocatedCallable.call(TaskSchedulerAppCallbackWrapper.java:165)
-> at org.apache.tez.dag.app.rm.TaskSchedulerAppCallbackWrapper$TaskAllocatedCallable.call(TaskSchedulerAppCallbackWrapper.java:165)
-> at org.apache.tez.dag.app.rm.TaskSchedulerAppCallbackWrapper$TaskAllocatedCallable.call(TaskSchedulerAppCallbackWrapper.java:165)

  TestVertexImpl.testBadCommitter2:1832->initAllVertices:1175 expected:<INITED> but
was:<NEW>
  TestVertexImpl.testInitStartRace2:2159 expected:<RUNNING> but was:<ERROR>
  TestVertexImpl.testVertexStart:1264->initAllVertices:1175 expected:<INITED> but
was:<NEW>
  TestVertexImpl.testVertexSuccessToFailedAfterTaskScheduler:1706->initAllVertices:1175
expected:<INITED> but was:<NEW>
  TestVertexImpl.testTaskReschedule:1619->initAllVertices:1175 expected:<INITED>
but was:<NEW>
  TestVertexImpl.testVertexFailure:1350->initAllVertices:1175 expected:<INITED> but
was:<NEW>
  TestVertexImpl.testVertexCommit:1735->initAllVertices:1175 expected:<INITED> but
was:<NEW>
  TestVertexImpl.testSourceVertexStartHandling:1516->initAllVertices:1175 expected:<INITED>
but was:<NEW>
  TestVertexImpl.testKilledTasksHandling:1444->initAllVertices:1175 expected:<INITED>
but was:<NEW>
  TestVertexImpl.testSourceTaskAttemptCompletionEvents:1548->initAllVertices:1175 expected:<INITED>
but was:<NEW>
  TestVertexImpl.testVertexInit:1215->initAllVertices:1175 expected:<INITED> but
was:<NEW>
  TestVertexImpl.testVertexKill:1418->initAllVertices:1175 expected:<INITED> but
was:<NEW>
  TestVertexImpl.testBasicVertexCompletion:1297->initAllVertices:1175 expected:<INITED>
but was:<NEW>
  TestVertexImpl.testVertexSuccessToRunningAfterTaskScheduler:1650->initAllVertices:1175
expected:<INITED> but was:<NEW>
  TestVertexImpl.testVertexWithOneToOneSplit:1866->initAllVertices:1175 expected:<INITIALIZING>
but was:<NEW>
  TestVertexImpl.testVertexSetParallelism:1272->initAllVertices:1175 expected:<INITED>
but was:<NEW>
  TestVertexImpl.testVertexManagerInit:1473->initAllVertices:1175 expected:<INITED>
but was:<NEW>
  TestVertexImpl.testVertexCommitterInit:1462->initAllVertices:1175 expected:<INITED>
but was:<NEW>
  TestVertexImpl.testVertexKillPending:1392->initAllVertices:1175 expected:<INITED>
but was:<NEW>
  TestVertexImpl.testBadCommitter:1789->initAllVertices:1175 expected:<INITED> but
was:<NEW>
  TestVertexImpl.testDAGEventGeneration:1596->initAllVertices:1175 expected:<INITED>
but was:<NEW>
  TestVertexImpl.testVertexWithInitializerSuccess:1960 expected:<INITIALIZING> but was:<NEW>
  TestVertexImpl.testVertexTaskFailure:1486->initAllVertices:1175 expected:<INITED>
but was:<NEW>
  TestVertexImpl.testInitStartRace:2131 expected:<RUNNING> but was:<ERROR>
  TestVertexImpl.testVertexWithInitializerFailure:1927 expected:<INITIALIZING> but was:<NEW>
  TestVertexImpl.testVertexKillDiagnostics:1370->initAllVertices:1175 expected:<INITED>
but was:<NEW>
  TestDAGImpl.testVertexReRunning:610->startDAG:549 expected:<RUNNING> but was:<ERROR>
  TestDAGImpl.testDAGStart:561->startDAG:549 expected:<RUNNING> but was:<ERROR>
  TestDAGImpl.testVertexCompletion:590->startDAG:549 expected:<RUNNING> but was:<ERROR>
  TestDAGImpl.testVertexFailureHandling:743->startDAG:549 expected:<RUNNING> but
was:<ERROR>
  TestDAGImpl.testDAGKill:778->startDAG:549 expected:<RUNNING> but was:<ERROR>
  TestDAGImpl.testDAGKillPending:809->startDAG:549 expected:<RUNNING> but was:<ERROR>
  TestDAGImpl.testKillRunningDAG:669->startDAG:549 expected:<RUNNING> but was:<ERROR>

Tests in error: 
  TestVertexImpl.testVertexWithNoTasks:2009 ยป NullPointer Configuration must be ...

Tests run: 108, Failures: 34, Errors: 1, Skipped: 4

[INFO] ------------------------------------------------------------------------
[INFO] Reactor Summary:
[INFO] 
[INFO] tez ............................................... SUCCESS [2.424s]
[INFO] tez-api ........................................... SUCCESS [17.588s]
[INFO] tez-common ........................................ SUCCESS [2.325s]
[INFO] tez-runtime-internals ............................. SUCCESS [3.698s]
[INFO] tez-runtime-library ............................... SUCCESS [7.862s]
[INFO] tez-mapreduce ..................................... SUCCESS [16.055s]
[INFO] tez-mapreduce-examples ............................ SUCCESS [2.521s]
[INFO] tez-dag ........................................... FAILURE [26.017s]
[INFO] tez-tests ......................................... SKIPPED
[INFO] tez-dist .......................................... SKIPPED
[INFO] Tez ............................................... SKIPPED
[INFO] ------------------------------------------------------------------------
[INFO] BUILD FAILURE
[INFO] ------------------------------------------------------------------------
[INFO] Total time: 1:18.799s
[INFO] Finished at: Mon Jan 13 20:51:01 UTC 2014
[INFO] Final Memory: 26M/345M
[INFO] ------------------------------------------------------------------------
[ERROR] Failed to execute goal org.apache.maven.plugins:maven-surefire-plugin:2.14.1:test
(default-test) on project tez-dag: There are test failures.
[ERROR] 
[ERROR] Please refer to <https://builds.apache.org/job/Tez-Build/ws/tez-dag/target/surefire-reports>
for the individual test results.
[ERROR] -> [Help 1]
[ERROR] 
[ERROR] To see the full stack trace of the errors, re-run Maven with the -e switch.
[ERROR] Re-run Maven using the -X switch to enable full debug logging.
[ERROR] 
[ERROR] For more information about the errors and possible solutions, please read the following
articles:
[ERROR] [Help 1] http://cwiki.apache.org/confluence/display/MAVEN/MojoFailureException
[ERROR] 
[ERROR] After correcting the problems, you can resume the build with the command
[ERROR]   mvn <goals> -rf :tez-dag
Build step 'Execute shell' marked build as failure
Archiving artifacts
Recording test results

Mime
View raw message