tez-dev mailing list archives

Site index · List index
Message view « Date » · « Thread »
Top « Date » · « Thread »
From Apache Jenkins Server <jenk...@builds.apache.org>
Subject Build failed in Jenkins: Tez-Build #252
Date Sun, 12 Jan 2014 21:06:22 GMT
See <https://builds.apache.org/job/Tez-Build/252/changes>

Changes:

[bikas] TEZ-582. Refactor and abstract out VertexManager to enable users to plugin their own
logic (bikas)

------------------------------------------
[...truncated 1222 lines...]
76 KB   
80 KB   
84 KB   
88 KB   
92 KB   
96 KB   
100 KB   
104 KB   
108 KB   
112 KB   
116 KB   
120 KB   
124 KB   
128 KB   
132 KB   
136 KB   
140 KB   
144 KB   
148 KB   
152 KB   
156 KB   
160 KB   
164 KB   
168 KB   
172 KB   
176 KB   
180 KB   
183 KB   
         
Uploaded: https://repository.apache.org/content/repositories/snapshots/org/apache/tez/tez-mapreduce-examples/0.3.0-SNAPSHOT/tez-mapreduce-examples-0.3.0-20140112.205051-13.jar
(183 KB at 431.4 KB/sec)
Uploading: https://repository.apache.org/content/repositories/snapshots/org/apache/tez/tez-mapreduce-examples/0.3.0-SNAPSHOT/tez-mapreduce-examples-0.3.0-20140112.205051-13.pom
3 KB     
       
Uploaded: https://repository.apache.org/content/repositories/snapshots/org/apache/tez/tez-mapreduce-examples/0.3.0-SNAPSHOT/tez-mapreduce-examples-0.3.0-20140112.205051-13.pom
(3 KB at 22.4 KB/sec)
Downloading: https://repository.apache.org/content/repositories/snapshots/org/apache/tez/tez-mapreduce-examples/maven-metadata.xml
336 B   
        
Downloaded: https://repository.apache.org/content/repositories/snapshots/org/apache/tez/tez-mapreduce-examples/maven-metadata.xml
(336 B at 2.5 KB/sec)
Uploading: https://repository.apache.org/content/repositories/snapshots/org/apache/tez/tez-mapreduce-examples/0.3.0-SNAPSHOT/maven-metadata.xml
1002 B   
         
Uploaded: https://repository.apache.org/content/repositories/snapshots/org/apache/tez/tez-mapreduce-examples/0.3.0-SNAPSHOT/maven-metadata.xml
(1002 B at 5.7 KB/sec)
Uploading: https://repository.apache.org/content/repositories/snapshots/org/apache/tez/tez-mapreduce-examples/maven-metadata.xml
336 B    
        
Uploaded: https://repository.apache.org/content/repositories/snapshots/org/apache/tez/tez-mapreduce-examples/maven-metadata.xml
(336 B at 2.4 KB/sec)
Uploading: https://repository.apache.org/content/repositories/snapshots/org/apache/tez/tez-mapreduce-examples/0.3.0-SNAPSHOT/tez-mapreduce-examples-0.3.0-20140112.205051-13-tests.jar
4 KB    
5 KB   
       
Uploaded: https://repository.apache.org/content/repositories/snapshots/org/apache/tez/tez-mapreduce-examples/0.3.0-SNAPSHOT/tez-mapreduce-examples-0.3.0-20140112.205051-13-tests.jar
(5 KB at 34.4 KB/sec)
Uploading: https://repository.apache.org/content/repositories/snapshots/org/apache/tez/tez-mapreduce-examples/0.3.0-SNAPSHOT/maven-metadata.xml
1002 B   
         
Uploaded: https://repository.apache.org/content/repositories/snapshots/org/apache/tez/tez-mapreduce-examples/0.3.0-SNAPSHOT/maven-metadata.xml
(1002 B at 4.0 KB/sec)
[INFO] 
[INFO] --- maven-resources-plugin:2.6:resources (default-resources) @ tez-mapreduce-examples
---
[INFO] Using 'UTF-8' encoding to copy filtered resources.
[INFO] skip non existing resourceDirectory <https://builds.apache.org/job/Tez-Build/ws/tez-mapreduce-examples/src/main/resources>
[INFO] 
[INFO] --- maven-compiler-plugin:3.1:compile (default-compile) @ tez-mapreduce-examples ---
[INFO] Nothing to compile - all classes are up to date
[INFO] 
[INFO] --- maven-resources-plugin:2.6:testResources (default-testResources) @ tez-mapreduce-examples
---
[INFO] Using 'UTF-8' encoding to copy filtered resources.
[INFO] skip non existing resourceDirectory <https://builds.apache.org/job/Tez-Build/ws/tez-mapreduce-examples/src/test/resources>
[INFO] 
[INFO] --- maven-compiler-plugin:3.1:testCompile (default-testCompile) @ tez-mapreduce-examples
---
[INFO] Nothing to compile - all classes are up to date
[INFO] 
[INFO] --- maven-surefire-plugin:2.14.1:test (default-test) @ tez-mapreduce-examples ---
[INFO] Skipping execution of surefire because it has already been run for this configuration
[INFO] 
[INFO] --- maven-jar-plugin:2.3.1:jar (default-jar) @ tez-mapreduce-examples ---
[INFO] Building jar: <https://builds.apache.org/job/Tez-Build/ws/tez-mapreduce-examples/target/tez-mapreduce-examples-0.3.0-SNAPSHOT.jar>
[INFO] 
[INFO] --- maven-jar-plugin:2.3.1:test-jar (default) @ tez-mapreduce-examples ---
[INFO] Building jar: <https://builds.apache.org/job/Tez-Build/ws/tez-mapreduce-examples/target/tez-mapreduce-examples-0.3.0-SNAPSHOT-tests.jar>
[INFO]                                                                         
[INFO] ------------------------------------------------------------------------
[INFO] Building tez-dag 0.3.0-SNAPSHOT
[INFO] ------------------------------------------------------------------------
[INFO] 
[INFO] --- maven-clean-plugin:2.4.1:clean (default-clean) @ tez-dag ---
[INFO] 
[INFO] --- avro-maven-plugin:1.5.3:protocol (default) @ tez-dag ---
[INFO] 
[INFO] --- maven-resources-plugin:2.6:resources (default-resources) @ tez-dag ---
[INFO] Using 'UTF-8' encoding to copy filtered resources.
[INFO] Copying 2 resources
[INFO] 
[INFO] --- maven-compiler-plugin:3.1:compile (default-compile) @ tez-dag ---
[INFO] Changes detected - recompiling the module!
[INFO] Compiling 201 source files to <https://builds.apache.org/job/Tez-Build/ws/tez-dag/target/classes>
[WARNING] Note: Some input files use or override a deprecated API.
[WARNING] Note: Recompile with -Xlint:deprecation for details.
[WARNING] Note: <https://builds.apache.org/job/Tez-Build/ws/tez-dag/src/main/java/org/apache/tez/dag/app/speculate/DefaultSpeculator.java>
uses unchecked or unsafe operations.
[WARNING] Note: Recompile with -Xlint:unchecked for details.
[INFO] 
[INFO] --- maven-resources-plugin:2.6:testResources (default-testResources) @ tez-dag ---
[INFO] Using 'UTF-8' encoding to copy filtered resources.
[INFO] Copying 1 resource
[INFO] 
[INFO] --- maven-compiler-plugin:3.1:testCompile (default-testCompile) @ tez-dag ---
[INFO] Changes detected - recompiling the module!
[INFO] Compiling 11 source files to <https://builds.apache.org/job/Tez-Build/ws/tez-dag/target/test-classes>
[WARNING] Note: <https://builds.apache.org/job/Tez-Build/ws/tez-dag/src/test/java/org/apache/tez/dag/app/rm/TestTezAMRMClient.java>
uses unchecked or unsafe operations.
[WARNING] Note: Recompile with -Xlint:unchecked for details.
[INFO] 
[INFO] --- maven-surefire-plugin:2.14.1:test (default-test) @ tez-dag ---
[INFO] Surefire report directory: <https://builds.apache.org/job/Tez-Build/ws/tez-dag/target/surefire-reports>

-------------------------------------------------------
 T E S T S
-------------------------------------------------------

-------------------------------------------------------
 T E S T S
-------------------------------------------------------
Running org.apache.tez.dag.app.rm.TestContainerReuse
Tests run: 6, Failures: 0, Errors: 0, Skipped: 0, Time elapsed: 10.95 sec
Running org.apache.tez.dag.app.rm.container.TestAMContainer
Tests run: 23, Failures: 0, Errors: 0, Skipped: 0, Time elapsed: 1.283 sec
Running org.apache.tez.dag.app.rm.node.TestAMNodeMap
Tests run: 2, Failures: 0, Errors: 0, Skipped: 0, Time elapsed: 0.564 sec
Running org.apache.tez.dag.app.rm.TestTezAMRMClient
Tests run: 1, Failures: 0, Errors: 0, Skipped: 0, Time elapsed: 0.678 sec
Running org.apache.tez.dag.app.rm.TestTaskScheduler
Tests run: 4, Failures: 0, Errors: 0, Skipped: 0, Time elapsed: 1.272 sec
Running org.apache.tez.dag.app.dag.impl.TestDAGImpl
Tests run: 13, Failures: 7, Errors: 0, Skipped: 2, Time elapsed: 1.83 sec <<< FAILURE!
testVertexReRunning(org.apache.tez.dag.app.dag.impl.TestDAGImpl)  Time elapsed: 1.26 sec 
<<< FAILURE!
java.lang.AssertionError: expected:<RUNNING> but was:<ERROR>
	at org.junit.Assert.fail(Assert.java:88)
	at org.junit.Assert.failNotEquals(Assert.java:743)
	at org.junit.Assert.assertEquals(Assert.java:118)
	at org.junit.Assert.assertEquals(Assert.java:144)
	at org.apache.tez.dag.app.dag.impl.TestDAGImpl.startDAG(TestDAGImpl.java:549)
	at org.apache.tez.dag.app.dag.impl.TestDAGImpl.testVertexReRunning(TestDAGImpl.java:610)

testDAGStart(org.apache.tez.dag.app.dag.impl.TestDAGImpl)  Time elapsed: 0.049 sec  <<<
FAILURE!
java.lang.AssertionError: expected:<RUNNING> but was:<ERROR>
	at org.junit.Assert.fail(Assert.java:88)
	at org.junit.Assert.failNotEquals(Assert.java:743)
	at org.junit.Assert.assertEquals(Assert.java:118)
	at org.junit.Assert.assertEquals(Assert.java:144)
	at org.apache.tez.dag.app.dag.impl.TestDAGImpl.startDAG(TestDAGImpl.java:549)
	at org.apache.tez.dag.app.dag.impl.TestDAGImpl.testDAGStart(TestDAGImpl.java:561)

testVertexCompletion(org.apache.tez.dag.app.dag.impl.TestDAGImpl)  Time elapsed: 0.048 sec
 <<< FAILURE!
java.lang.AssertionError: expected:<RUNNING> but was:<ERROR>
	at org.junit.Assert.fail(Assert.java:88)
	at org.junit.Assert.failNotEquals(Assert.java:743)
	at org.junit.Assert.assertEquals(Assert.java:118)
	at org.junit.Assert.assertEquals(Assert.java:144)
	at org.apache.tez.dag.app.dag.impl.TestDAGImpl.startDAG(TestDAGImpl.java:549)
	at org.apache.tez.dag.app.dag.impl.TestDAGImpl.testVertexCompletion(TestDAGImpl.java:590)

testVertexFailureHandling(org.apache.tez.dag.app.dag.impl.TestDAGImpl)  Time elapsed: 0.045
sec  <<< FAILURE!
java.lang.AssertionError: expected:<RUNNING> but was:<ERROR>
	at org.junit.Assert.fail(Assert.java:88)
	at org.junit.Assert.failNotEquals(Assert.java:743)
	at org.junit.Assert.assertEquals(Assert.java:118)
	at org.junit.Assert.assertEquals(Assert.java:144)
	at org.apache.tez.dag.app.dag.impl.TestDAGImpl.startDAG(TestDAGImpl.java:549)
	at org.apache.tez.dag.app.dag.impl.TestDAGImpl.testVertexFailureHandling(TestDAGImpl.java:743)

testDAGKill(org.apache.tez.dag.app.dag.impl.TestDAGImpl)  Time elapsed: 0.044 sec  <<<
FAILURE!
java.lang.AssertionError: expected:<RUNNING> but was:<ERROR>
	at org.junit.Assert.fail(Assert.java:88)
	at org.junit.Assert.failNotEquals(Assert.java:743)
	at org.junit.Assert.assertEquals(Assert.java:118)
	at org.junit.Assert.assertEquals(Assert.java:144)
	at org.apache.tez.dag.app.dag.impl.TestDAGImpl.startDAG(TestDAGImpl.java:549)
	at org.apache.tez.dag.app.dag.impl.TestDAGImpl.testDAGKill(TestDAGImpl.java:778)

testDAGKillPending(org.apache.tez.dag.app.dag.impl.TestDAGImpl)  Time elapsed: 0.032 sec 
<<< FAILURE!
java.lang.AssertionError: expected:<RUNNING> but was:<ERROR>
	at org.junit.Assert.fail(Assert.java:88)
	at org.junit.Assert.failNotEquals(Assert.java:743)
	at org.junit.Assert.assertEquals(Assert.java:118)
	at org.junit.Assert.assertEquals(Assert.java:144)
	at org.apache.tez.dag.app.dag.impl.TestDAGImpl.startDAG(TestDAGImpl.java:549)
	at org.apache.tez.dag.app.dag.impl.TestDAGImpl.testDAGKillPending(TestDAGImpl.java:809)

testKillRunningDAG(org.apache.tez.dag.app.dag.impl.TestDAGImpl)  Time elapsed: 0.031 sec 
<<< FAILURE!
java.lang.AssertionError: expected:<RUNNING> but was:<ERROR>
	at org.junit.Assert.fail(Assert.java:88)
	at org.junit.Assert.failNotEquals(Assert.java:743)
	at org.junit.Assert.assertEquals(Assert.java:118)
	at org.junit.Assert.assertEquals(Assert.java:144)
	at org.apache.tez.dag.app.dag.impl.TestDAGImpl.startDAG(TestDAGImpl.java:549)
	at org.apache.tez.dag.app.dag.impl.TestDAGImpl.testKillRunningDAG(TestDAGImpl.java:669)

Running org.apache.tez.dag.app.dag.impl.TestTaskAttempt
Tests run: 9, Failures: 0, Errors: 0, Skipped: 0, Time elapsed: 2.558 sec
Running org.apache.tez.dag.app.dag.impl.TestVertexImpl
Running org.apache.tez.dag.app.dag.impl.TestTaskImpl
Tests run: 12, Failures: 0, Errors: 0, Skipped: 0, Time elapsed: 1.261 sec
Running org.apache.tez.dag.app.dag.impl.TestDAGScheduler
Tests run: 2, Failures: 0, Errors: 0, Skipped: 1, Time elapsed: 0.58 sec

Results :

Failed tests: 
  TestDAGImpl.testVertexReRunning:610->startDAG:549 expected:<RUNNING> but was:<ERROR>
  TestDAGImpl.testDAGStart:561->startDAG:549 expected:<RUNNING> but was:<ERROR>
  TestDAGImpl.testVertexCompletion:590->startDAG:549 expected:<RUNNING> but was:<ERROR>
  TestDAGImpl.testVertexFailureHandling:743->startDAG:549 expected:<RUNNING> but
was:<ERROR>
  TestDAGImpl.testDAGKill:778->startDAG:549 expected:<RUNNING> but was:<ERROR>
  TestDAGImpl.testDAGKillPending:809->startDAG:549 expected:<RUNNING> but was:<ERROR>
  TestDAGImpl.testKillRunningDAG:669->startDAG:549 expected:<RUNNING> but was:<ERROR>

Tests run: 72, Failures: 7, Errors: 0, Skipped: 3

[INFO] ------------------------------------------------------------------------
[INFO] Reactor Summary:
[INFO] 
[INFO] tez ............................................... SUCCESS [2.540s]
[INFO] tez-api ........................................... SUCCESS [20.327s]
[INFO] tez-common ........................................ SUCCESS [2.517s]
[INFO] tez-runtime-internals ............................. SUCCESS [4.357s]
[INFO] tez-runtime-library ............................... SUCCESS [9.787s]
[INFO] tez-mapreduce ..................................... SUCCESS [16.939s]
[INFO] tez-mapreduce-examples ............................ SUCCESS [2.870s]
[INFO] tez-dag ........................................... FAILURE [15:25.883s]
[INFO] tez-tests ......................................... SKIPPED
[INFO] tez-dist .......................................... SKIPPED
[INFO] Tez ............................................... SKIPPED
[INFO] ------------------------------------------------------------------------
[INFO] BUILD FAILURE
[INFO] ------------------------------------------------------------------------
[INFO] Total time: 16:25.601s
[INFO] Finished at: Sun Jan 12 21:06:19 UTC 2014
[INFO] Final Memory: 27M/719M
[INFO] ------------------------------------------------------------------------
[ERROR] Failed to execute goal org.apache.maven.plugins:maven-surefire-plugin:2.14.1:test
(default-test) on project tez-dag: There was a timeout or other error in the fork -> [Help
1]
[ERROR] 
[ERROR] To see the full stack trace of the errors, re-run Maven with the -e switch.
[ERROR] Re-run Maven using the -X switch to enable full debug logging.
[ERROR] 
[ERROR] For more information about the errors and possible solutions, please read the following
articles:
[ERROR] [Help 1] http://cwiki.apache.org/confluence/display/MAVEN/MojoFailureException
[ERROR] 
[ERROR] After correcting the problems, you can resume the build with the command
[ERROR]   mvn <goals> -rf :tez-dag
Build step 'Execute shell' marked build as failure
Archiving artifacts
Recording test results

Mime
View raw message