tez-dev mailing list archives

Site index · List index
Message view « Date » · « Thread »
Top « Date » · « Thread »
From Apache Jenkins Server <jenk...@builds.apache.org>
Subject Build failed in Jenkins: Tez-Build #307
Date Sun, 16 Feb 2014 03:51:57 GMT
See <https://builds.apache.org/job/Tez-Build/307/changes>

Changes:

[bikas] TEZ-825. Fix incorrect inheritance method calls in ThreeLevels and SixLevels failing
dags. (Tassapol Athiapinya via bikas)

------------------------------------------
[...truncated 1261 lines...]
36 KB   
40 KB   
44 KB   
48 KB   
52 KB   
56 KB   
60 KB   
64 KB   
68 KB   
72 KB   
76 KB   
80 KB   
84 KB   
88 KB   
92 KB   
96 KB   
100 KB   
104 KB   
108 KB   
112 KB   
116 KB   
120 KB   
124 KB   
128 KB   
132 KB   
136 KB   
140 KB   
144 KB   
148 KB   
152 KB   
156 KB   
160 KB   
164 KB   
168 KB   
172 KB   
176 KB   
180 KB   
184 KB   
188 KB   
190 KB   
         
Uploaded: https://repository.apache.org/content/repositories/snapshots/org/apache/tez/tez-mapreduce-examples/0.3.0-incubating-SNAPSHOT/tez-mapreduce-examples-0.3.0-incubating-20140216.035116-38.jar
(190 KB at 353.2 KB/sec)
Uploading: https://repository.apache.org/content/repositories/snapshots/org/apache/tez/tez-mapreduce-examples/0.3.0-incubating-SNAPSHOT/tez-mapreduce-examples-0.3.0-incubating-20140216.035116-38.pom
3 KB     
       
Uploaded: https://repository.apache.org/content/repositories/snapshots/org/apache/tez/tez-mapreduce-examples/0.3.0-incubating-SNAPSHOT/tez-mapreduce-examples-0.3.0-incubating-20140216.035116-38.pom
(3 KB at 21.4 KB/sec)
Downloading: https://repository.apache.org/content/repositories/snapshots/org/apache/tez/tez-mapreduce-examples/maven-metadata.xml
418 B   
        
Downloaded: https://repository.apache.org/content/repositories/snapshots/org/apache/tez/tez-mapreduce-examples/maven-metadata.xml
(418 B at 2.9 KB/sec)
Uploading: https://repository.apache.org/content/repositories/snapshots/org/apache/tez/tez-mapreduce-examples/0.3.0-incubating-SNAPSHOT/maven-metadata.xml
2 KB    
       
Uploaded: https://repository.apache.org/content/repositories/snapshots/org/apache/tez/tez-mapreduce-examples/0.3.0-incubating-SNAPSHOT/maven-metadata.xml
(2 KB at 4.5 KB/sec)
Uploading: https://repository.apache.org/content/repositories/snapshots/org/apache/tez/tez-mapreduce-examples/maven-metadata.xml
418 B   
        
Uploaded: https://repository.apache.org/content/repositories/snapshots/org/apache/tez/tez-mapreduce-examples/maven-metadata.xml
(418 B at 2.9 KB/sec)
Uploading: https://repository.apache.org/content/repositories/snapshots/org/apache/tez/tez-mapreduce-examples/0.3.0-incubating-SNAPSHOT/tez-mapreduce-examples-0.3.0-incubating-20140216.035116-38-tests.jar
4 KB    
5 KB   
       
Uploaded: https://repository.apache.org/content/repositories/snapshots/org/apache/tez/tez-mapreduce-examples/0.3.0-incubating-SNAPSHOT/tez-mapreduce-examples-0.3.0-incubating-20140216.035116-38-tests.jar
(5 KB at 23.1 KB/sec)
Uploading: https://repository.apache.org/content/repositories/snapshots/org/apache/tez/tez-mapreduce-examples/0.3.0-incubating-SNAPSHOT/maven-metadata.xml
2 KB   
       
Uploaded: https://repository.apache.org/content/repositories/snapshots/org/apache/tez/tez-mapreduce-examples/0.3.0-incubating-SNAPSHOT/maven-metadata.xml
(2 KB at 7.6 KB/sec)
[INFO] 
[INFO] --- maven-resources-plugin:2.6:resources (default-resources) @ tez-mapreduce-examples
---
[INFO] Using 'UTF-8' encoding to copy filtered resources.
[INFO] skip non existing resourceDirectory <https://builds.apache.org/job/Tez-Build/ws/tez-mapreduce-examples/src/main/resources>
[INFO] 
[INFO] --- maven-compiler-plugin:3.1:compile (default-compile) @ tez-mapreduce-examples ---
[INFO] Nothing to compile - all classes are up to date
[INFO] 
[INFO] --- maven-resources-plugin:2.6:testResources (default-testResources) @ tez-mapreduce-examples
---
[INFO] Using 'UTF-8' encoding to copy filtered resources.
[INFO] skip non existing resourceDirectory <https://builds.apache.org/job/Tez-Build/ws/tez-mapreduce-examples/src/test/resources>
[INFO] 
[INFO] --- maven-compiler-plugin:3.1:testCompile (default-testCompile) @ tez-mapreduce-examples
---
[INFO] Nothing to compile - all classes are up to date
[INFO] 
[INFO] --- maven-surefire-plugin:2.14.1:test (default-test) @ tez-mapreduce-examples ---
[INFO] Skipping execution of surefire because it has already been run for this configuration
[INFO] 
[INFO] --- maven-jar-plugin:2.3.1:jar (default-jar) @ tez-mapreduce-examples ---
[INFO] Building jar: <https://builds.apache.org/job/Tez-Build/ws/tez-mapreduce-examples/target/tez-mapreduce-examples-0.3.0-incubating-SNAPSHOT.jar>
[INFO] 
[INFO] --- maven-jar-plugin:2.3.1:test-jar (default) @ tez-mapreduce-examples ---
[INFO] Building jar: <https://builds.apache.org/job/Tez-Build/ws/tez-mapreduce-examples/target/tez-mapreduce-examples-0.3.0-incubating-SNAPSHOT-tests.jar>
[INFO]                                                                         
[INFO] ------------------------------------------------------------------------
[INFO] Building tez-dag 0.3.0-incubating-SNAPSHOT
[INFO] ------------------------------------------------------------------------
[INFO] 
[INFO] --- maven-clean-plugin:2.4.1:clean (default-clean) @ tez-dag ---
[INFO] Deleting <https://builds.apache.org/job/Tez-Build/ws/tez-dag/target>
[INFO] 
[INFO] --- hadoop-maven-plugins:2.2.0:protoc (compile-protoc) @ tez-dag ---
[INFO] 
[INFO] --- maven-resources-plugin:2.6:resources (default-resources) @ tez-dag ---
[INFO] Using 'UTF-8' encoding to copy filtered resources.
[INFO] Copying 2 resources
[INFO] 
[INFO] --- maven-compiler-plugin:3.1:compile (default-compile) @ tez-dag ---
[INFO] Changes detected - recompiling the module!
[INFO] Compiling 188 source files to <https://builds.apache.org/job/Tez-Build/ws/tez-dag/target/classes>
[INFO] 
[INFO] --- maven-resources-plugin:2.6:testResources (default-testResources) @ tez-dag ---
[INFO] Using 'UTF-8' encoding to copy filtered resources.
[INFO] Copying 1 resource
[INFO] 
[INFO] --- maven-compiler-plugin:3.1:testCompile (default-testCompile) @ tez-dag ---
[INFO] Changes detected - recompiling the module!
[INFO] Compiling 15 source files to <https://builds.apache.org/job/Tez-Build/ws/tez-dag/target/test-classes>
[WARNING] Note: <https://builds.apache.org/job/Tez-Build/ws/tez-dag/src/test/java/org/apache/tez/dag/app/rm/TestTezAMRMClient.java>
uses unchecked or unsafe operations.
[WARNING] Note: Recompile with -Xlint:unchecked for details.
[INFO] 
[INFO] --- maven-surefire-plugin:2.14.1:test (default-test) @ tez-dag ---
[INFO] Surefire report directory: <https://builds.apache.org/job/Tez-Build/ws/tez-dag/target/surefire-reports>

-------------------------------------------------------
 T E S T S
-------------------------------------------------------

-------------------------------------------------------
 T E S T S
-------------------------------------------------------
Running org.apache.tez.dag.api.client.TestVertexStatusBuilder
Tests run: 1, Failures: 0, Errors: 0, Skipped: 0, Time elapsed: 0.076 sec
Running org.apache.tez.dag.app.rm.TestContainerReuse
Tests run: 6, Failures: 0, Errors: 0, Skipped: 0, Time elapsed: 10.799 sec
Running org.apache.tez.dag.app.rm.container.TestAMContainer
Tests run: 24, Failures: 0, Errors: 0, Skipped: 0, Time elapsed: 0.924 sec
Running org.apache.tez.dag.app.rm.container.TestAMContainerMap
Tests run: 1, Failures: 0, Errors: 0, Skipped: 0, Time elapsed: 0.644 sec
Running org.apache.tez.dag.app.rm.node.TestAMNodeMap
Tests run: 3, Failures: 0, Errors: 0, Skipped: 0, Time elapsed: 0.708 sec
Running org.apache.tez.dag.app.rm.TestTezAMRMClient
Tests run: 1, Failures: 0, Errors: 0, Skipped: 0, Time elapsed: 0.676 sec
Running org.apache.tez.dag.app.rm.TestTaskScheduler
Tests run: 4, Failures: 1, Errors: 0, Skipped: 0, Time elapsed: 1.28 sec <<< FAILURE!
testTaskSchedulerWithReuse(org.apache.tez.dag.app.rm.TestTaskScheduler)  Time elapsed: 0.072
sec  <<< FAILURE!
org.mockito.exceptions.verification.WantedButNotInvoked: 
Wanted but not invoked:
taskSchedulerAppCallback.taskAllocated(
    Mock for ClassWithSuperclassToWorkAroundCglibBug, hashCode: 22885256,
    Mock for ClassWithSuperclassToWorkAroundCglibBug, hashCode: 189219,
    Mock for Container, hashCode: 26100519
);
-> at org.apache.tez.dag.app.rm.TestTaskScheduler.testTaskSchedulerWithReuse(TestTaskScheduler.java:699)

However, there were other interactions with this mock:
-> at org.apache.tez.dag.app.rm.TaskSchedulerAppCallbackWrapper$SetApplicationRegistrationDataCallable.call(TaskSchedulerAppCallbackWrapper.java:257)
-> at org.apache.tez.dag.app.rm.TaskSchedulerAppCallbackWrapper$TaskAllocatedCallable.call(TaskSchedulerAppCallbackWrapper.java:165)
-> at org.apache.tez.dag.app.rm.TaskSchedulerAppCallbackWrapper$TaskAllocatedCallable.call(TaskSchedulerAppCallbackWrapper.java:165)
-> at org.apache.tez.dag.app.rm.TaskSchedulerAppCallbackWrapper$TaskAllocatedCallable.call(TaskSchedulerAppCallbackWrapper.java:165)

	at org.apache.tez.dag.app.rm.TestTaskScheduler.testTaskSchedulerWithReuse(TestTaskScheduler.java:699)

Running org.apache.tez.dag.app.dag.impl.TestDAGImpl
Tests run: 18, Failures: 0, Errors: 0, Skipped: 2, Time elapsed: 2.436 sec
Running org.apache.tez.dag.app.dag.impl.TestTaskAttempt
Tests run: 10, Failures: 0, Errors: 0, Skipped: 0, Time elapsed: 1.471 sec
Running org.apache.tez.dag.app.dag.impl.TestEdge
Tests run: 1, Failures: 0, Errors: 0, Skipped: 0, Time elapsed: 0.67 sec
Running org.apache.tez.dag.app.dag.impl.TestVertexImpl
Tests run: 36, Failures: 2, Errors: 0, Skipped: 1, Time elapsed: 3.329 sec <<< FAILURE!
testVertexWithOneToOneSplit(org.apache.tez.dag.app.dag.impl.TestVertexImpl)  Time elapsed:
0.1 sec  <<< FAILURE!
java.lang.AssertionError: expected:<INITED> but was:<INITIALIZING>
	at org.junit.Assert.fail(Assert.java:88)
	at org.junit.Assert.failNotEquals(Assert.java:743)
	at org.junit.Assert.assertEquals(Assert.java:118)
	at org.junit.Assert.assertEquals(Assert.java:144)
	at org.apache.tez.dag.app.dag.impl.TestVertexImpl.testVertexWithOneToOneSplit(TestVertexImpl.java:2020)

testVertexWithInitializerSuccess(org.apache.tez.dag.app.dag.impl.TestVertexImpl)  Time elapsed:
0.047 sec  <<< FAILURE!
java.lang.AssertionError: expected:<INITED> but was:<INITIALIZING>
	at org.junit.Assert.fail(Assert.java:88)
	at org.junit.Assert.failNotEquals(Assert.java:743)
	at org.junit.Assert.assertEquals(Assert.java:118)
	at org.junit.Assert.assertEquals(Assert.java:144)
	at org.apache.tez.dag.app.dag.impl.TestVertexImpl.testVertexWithInitializerSuccess(TestVertexImpl.java:2109)

Running org.apache.tez.dag.app.dag.impl.TestTaskImpl
Tests run: 14, Failures: 0, Errors: 0, Skipped: 0, Time elapsed: 1.431 sec
Running org.apache.tez.dag.app.dag.impl.TestDAGScheduler
Tests run: 2, Failures: 0, Errors: 0, Skipped: 1, Time elapsed: 0.563 sec

Results :

Failed tests: 
  TestTaskScheduler.testTaskSchedulerWithReuse:699 
Wanted but not invoked:
taskSchedulerAppCallback.taskAllocated(
    Mock for ClassWithSuperclassToWorkAroundCglibBug, hashCode: 22885256,
    Mock for ClassWithSuperclassToWorkAroundCglibBug, hashCode: 189219,
    Mock for Container, hashCode: 26100519
);
-> at org.apache.tez.dag.app.rm.TestTaskScheduler.testTaskSchedulerWithReuse(TestTaskScheduler.java:699)

However, there were other interactions with this mock:
-> at org.apache.tez.dag.app.rm.TaskSchedulerAppCallbackWrapper$SetApplicationRegistrationDataCallable.call(TaskSchedulerAppCallbackWrapper.java:257)
-> at org.apache.tez.dag.app.rm.TaskSchedulerAppCallbackWrapper$TaskAllocatedCallable.call(TaskSchedulerAppCallbackWrapper.java:165)
-> at org.apache.tez.dag.app.rm.TaskSchedulerAppCallbackWrapper$TaskAllocatedCallable.call(TaskSchedulerAppCallbackWrapper.java:165)
-> at org.apache.tez.dag.app.rm.TaskSchedulerAppCallbackWrapper$TaskAllocatedCallable.call(TaskSchedulerAppCallbackWrapper.java:165)

  TestVertexImpl.testVertexWithOneToOneSplit:2020 expected:<INITED> but was:<INITIALIZING>
  TestVertexImpl.testVertexWithInitializerSuccess:2109 expected:<INITED> but was:<INITIALIZING>

Tests run: 121, Failures: 3, Errors: 0, Skipped: 4

[INFO] ------------------------------------------------------------------------
[INFO] Reactor Summary:
[INFO] 
[INFO] tez ............................................... SUCCESS [3.364s]
[INFO] tez-api ........................................... SUCCESS [23.967s]
[INFO] tez-common ........................................ SUCCESS [3.676s]
[INFO] tez-runtime-internals ............................. SUCCESS [6.060s]
[INFO] tez-runtime-library ............................... SUCCESS [9.415s]
[INFO] tez-mapreduce ..................................... SUCCESS [16.477s]
[INFO] tez-mapreduce-examples ............................ SUCCESS [5.562s]
[INFO] tez-dag ........................................... FAILURE [30.903s]
[INFO] tez-tests ......................................... SKIPPED
[INFO] tez-dist .......................................... SKIPPED
[INFO] Tez ............................................... SKIPPED
[INFO] ------------------------------------------------------------------------
[INFO] BUILD FAILURE
[INFO] ------------------------------------------------------------------------
[INFO] Total time: 1:39.832s
[INFO] Finished at: Sun Feb 16 03:51:49 UTC 2014
[INFO] Final Memory: 27M/722M
[INFO] ------------------------------------------------------------------------
[ERROR] Failed to execute goal org.apache.maven.plugins:maven-surefire-plugin:2.14.1:test
(default-test) on project tez-dag: There are test failures.
[ERROR] 
[ERROR] Please refer to <https://builds.apache.org/job/Tez-Build/ws/tez-dag/target/surefire-reports>
for the individual test results.
[ERROR] -> [Help 1]
[ERROR] 
[ERROR] To see the full stack trace of the errors, re-run Maven with the -e switch.
[ERROR] Re-run Maven using the -X switch to enable full debug logging.
[ERROR] 
[ERROR] For more information about the errors and possible solutions, please read the following
articles:
[ERROR] [Help 1] http://cwiki.apache.org/confluence/display/MAVEN/MojoFailureException
[ERROR] 
[ERROR] After correcting the problems, you can resume the build with the command
[ERROR]   mvn <goals> -rf :tez-dag
Build step 'Execute shell' marked build as failure
Archiving artifacts
Recording test results

Mime
View raw message