tez-dev mailing list archives

Site index · List index
Message view « Date » · « Thread »
Top « Date » · « Thread »
From Apache Jenkins Server <jenk...@builds.apache.org>
Subject Build failed in Jenkins: Tez-Build #288
Date Thu, 06 Feb 2014 22:57:19 GMT
See <https://builds.apache.org/job/Tez-Build/288/changes>

Changes:

[gunther] TEZ-777. Obtain tokens for LocalResources specified in the DAGPlan (Patch by Gunther
Hagleitner, reviewed by Siddharth Seth)

------------------------------------------
[...truncated 1622 lines...]
96 KB   
100 KB   
104 KB   
108 KB   
112 KB   
116 KB   
120 KB   
124 KB   
128 KB   
132 KB   
136 KB   
140 KB   
144 KB   
148 KB   
149 KB   
         
Uploaded: https://repository.apache.org/content/repositories/snapshots/org/apache/tez/tez-dag/0.3.0-incubating-SNAPSHOT/tez-dag-0.3.0-incubating-20140206.225207-12-tests.jar
(149 KB at 914.7 KB/sec)
Uploading: https://repository.apache.org/content/repositories/snapshots/org/apache/tez/tez-dag/0.3.0-incubating-SNAPSHOT/maven-metadata.xml
2 KB     
       
Uploaded: https://repository.apache.org/content/repositories/snapshots/org/apache/tez/tez-dag/0.3.0-incubating-SNAPSHOT/maven-metadata.xml
(2 KB at 7.6 KB/sec)
[INFO] 
[INFO] --- avro-maven-plugin:1.5.3:protocol (default) @ tez-dag ---
[INFO] 
[INFO] --- maven-resources-plugin:2.6:resources (default-resources) @ tez-dag ---
[INFO] Using 'UTF-8' encoding to copy filtered resources.
[INFO] Copying 2 resources
[INFO] 
[INFO] --- maven-compiler-plugin:3.1:compile (default-compile) @ tez-dag ---
[INFO] Nothing to compile - all classes are up to date
[INFO] 
[INFO] --- maven-resources-plugin:2.6:testResources (default-testResources) @ tez-dag ---
[INFO] Using 'UTF-8' encoding to copy filtered resources.
[INFO] Copying 1 resource
[INFO] 
[INFO] --- maven-compiler-plugin:3.1:testCompile (default-testCompile) @ tez-dag ---
[INFO] Nothing to compile - all classes are up to date
[INFO] 
[INFO] --- maven-surefire-plugin:2.14.1:test (default-test) @ tez-dag ---
[INFO] Skipping execution of surefire because it has already been run for this configuration
[INFO] 
[INFO] --- maven-jar-plugin:2.3.1:jar (default-jar) @ tez-dag ---
[INFO] Building jar: <https://builds.apache.org/job/Tez-Build/ws/tez-dag/target/tez-dag-0.3.0-incubating-SNAPSHOT.jar>
[INFO] 
[INFO] --- maven-jar-plugin:2.3.1:test-jar (default) @ tez-dag ---
[INFO] Building jar: <https://builds.apache.org/job/Tez-Build/ws/tez-dag/target/tez-dag-0.3.0-incubating-SNAPSHOT-tests.jar>
[INFO]                                                                         
[INFO] ------------------------------------------------------------------------
[INFO] Building tez-tests 0.3.0-incubating-SNAPSHOT
[INFO] ------------------------------------------------------------------------
[INFO] 
[INFO] --- maven-clean-plugin:2.4.1:clean (default-clean) @ tez-tests ---
[INFO] Deleting <https://builds.apache.org/job/Tez-Build/ws/tez-tests/target>
[INFO] 
[INFO] --- maven-resources-plugin:2.6:resources (default-resources) @ tez-tests ---
[INFO] Using 'UTF-8' encoding to copy filtered resources.
[INFO] skip non existing resourceDirectory <https://builds.apache.org/job/Tez-Build/ws/tez-tests/src/main/resources>
[INFO] 
[INFO] --- maven-compiler-plugin:3.1:compile (default-compile) @ tez-tests ---
[INFO] No sources to compile
[INFO] 
[INFO] --- maven-resources-plugin:2.6:testResources (default-testResources) @ tez-tests ---
[INFO] Using 'UTF-8' encoding to copy filtered resources.
[INFO] skip non existing resourceDirectory <https://builds.apache.org/job/Tez-Build/ws/tez-tests/src/test/resources>
[INFO] 
[INFO] --- maven-compiler-plugin:3.1:testCompile (default-testCompile) @ tez-tests ---
[INFO] Changes detected - recompiling the module!
[INFO] Compiling 13 source files to <https://builds.apache.org/job/Tez-Build/ws/tez-tests/target/test-classes>
[INFO] 
[INFO] --- maven-surefire-plugin:2.14.1:test (default-test) @ tez-tests ---
[INFO] Surefire report directory: <https://builds.apache.org/job/Tez-Build/ws/tez-tests/target/surefire-reports>

-------------------------------------------------------
 T E S T S
-------------------------------------------------------

-------------------------------------------------------
 T E S T S
-------------------------------------------------------
Running org.apache.tez.test.TestFaultTolerance
Tests run: 14, Failures: 0, Errors: 14, Skipped: 0, Time elapsed: 26.58 sec <<< FAILURE!
testThreeLevelsFailingDAG2VerticesHaveFailedAttemptsDAGSucceeds(org.apache.tez.test.TestFaultTolerance)
 Time elapsed: 3.436 sec  <<< ERROR!
java.lang.NullPointerException: null
	at org.apache.tez.client.TezClientUtils.setupDAGCredentials(TezClientUtils.java:278)
	at org.apache.tez.client.TezSession.submitDAG(TezSession.java:149)
	at org.apache.tez.test.TestFaultTolerance.runDAGAndVerify(TestFaultTolerance.java:121)
	at org.apache.tez.test.TestFaultTolerance.testThreeLevelsFailingDAG2VerticesHaveFailedAttemptsDAGSucceeds(TestFaultTolerance.java:309)

testMultiVersionInputFailureWithoutExit(org.apache.tez.test.TestFaultTolerance)  Time elapsed:
0.01 sec  <<< ERROR!
java.lang.NullPointerException: null
	at org.apache.tez.client.TezClientUtils.setupDAGCredentials(TezClientUtils.java:278)
	at org.apache.tez.client.TezSession.submitDAG(TezSession.java:149)
	at org.apache.tez.test.TestFaultTolerance.runDAGAndVerify(TestFaultTolerance.java:121)
	at org.apache.tez.test.TestFaultTolerance.testMultiVersionInputFailureWithoutExit(TestFaultTolerance.java:262)

testTaskMultipleFailuresDAGFail(org.apache.tez.test.TestFaultTolerance)  Time elapsed: 0.008
sec  <<< ERROR!
java.lang.NullPointerException: null
	at org.apache.tez.client.TezClientUtils.setupDAGCredentials(TezClientUtils.java:278)
	at org.apache.tez.client.TezSession.submitDAG(TezSession.java:149)
	at org.apache.tez.test.TestFaultTolerance.runDAGAndVerify(TestFaultTolerance.java:121)
	at org.apache.tez.test.TestFaultTolerance.testTaskMultipleFailuresDAGFail(TestFaultTolerance.java:194)

testTaskMultipleFailures(org.apache.tez.test.TestFaultTolerance)  Time elapsed: 0.01 sec 
<<< ERROR!
java.lang.NullPointerException: null
	at org.apache.tez.client.TezClientUtils.setupDAGCredentials(TezClientUtils.java:278)
	at org.apache.tez.client.TezSession.submitDAG(TezSession.java:149)
	at org.apache.tez.test.TestFaultTolerance.runDAGAndVerify(TestFaultTolerance.java:121)
	at org.apache.tez.test.TestFaultTolerance.testTaskMultipleFailures(TestFaultTolerance.java:180)

testInputFailureCausesRerunAttemptWithinMaxAttemptSuccess(org.apache.tez.test.TestFaultTolerance)
 Time elapsed: 0.056 sec  <<< ERROR!
java.lang.NullPointerException: null
	at org.apache.tez.client.TezClientUtils.setupDAGCredentials(TezClientUtils.java:278)
	at org.apache.tez.client.TezSession.submitDAG(TezSession.java:149)
	at org.apache.tez.test.TestFaultTolerance.runDAGAndVerify(TestFaultTolerance.java:121)
	at org.apache.tez.test.TestFaultTolerance.testInputFailureCausesRerunAttemptWithinMaxAttemptSuccess(TestFaultTolerance.java:357)

testBasicInputFailureWithoutExit(org.apache.tez.test.TestFaultTolerance)  Time elapsed: 0.008
sec  <<< ERROR!
java.lang.NullPointerException: null
	at org.apache.tez.client.TezClientUtils.setupDAGCredentials(TezClientUtils.java:278)
	at org.apache.tez.client.TezSession.submitDAG(TezSession.java:149)
	at org.apache.tez.test.TestFaultTolerance.runDAGAndVerify(TestFaultTolerance.java:121)
	at org.apache.tez.test.TestFaultTolerance.testBasicInputFailureWithoutExit(TestFaultTolerance.java:228)

testBasicTaskFailure(org.apache.tez.test.TestFaultTolerance)  Time elapsed: 0.008 sec  <<<
ERROR!
java.lang.NullPointerException: null
	at org.apache.tez.client.TezClientUtils.setupDAGCredentials(TezClientUtils.java:278)
	at org.apache.tez.client.TezSession.submitDAG(TezSession.java:149)
	at org.apache.tez.test.TestFaultTolerance.runDAGAndVerify(TestFaultTolerance.java:121)
	at org.apache.tez.test.TestFaultTolerance.testBasicTaskFailure(TestFaultTolerance.java:166)

testBasicSuccessScatterGather(org.apache.tez.test.TestFaultTolerance)  Time elapsed: 0.016
sec  <<< ERROR!
java.lang.NullPointerException: null
	at org.apache.tez.client.TezClientUtils.setupDAGCredentials(TezClientUtils.java:278)
	at org.apache.tez.client.TezSession.submitDAG(TezSession.java:149)
	at org.apache.tez.test.TestFaultTolerance.runDAGAndVerify(TestFaultTolerance.java:121)
	at org.apache.tez.test.TestFaultTolerance.testBasicSuccessScatterGather(TestFaultTolerance.java:138)

testThreeLevelsFailingDAGSuccess(org.apache.tez.test.TestFaultTolerance)  Time elapsed: 0.055
sec  <<< ERROR!
java.lang.NullPointerException: null
	at org.apache.tez.client.TezClientUtils.setupDAGCredentials(TezClientUtils.java:278)
	at org.apache.tez.client.TezSession.submitDAG(TezSession.java:149)
	at org.apache.tez.test.TestFaultTolerance.runDAGAndVerify(TestFaultTolerance.java:121)
	at org.apache.tez.test.TestFaultTolerance.testThreeLevelsFailingDAGSuccess(TestFaultTolerance.java:276)

testSixLevelsFailingDAGSuccess(org.apache.tez.test.TestFaultTolerance)  Time elapsed: 0.058
sec  <<< ERROR!
java.lang.NullPointerException: null
	at org.apache.tez.client.TezClientUtils.setupDAGCredentials(TezClientUtils.java:278)
	at org.apache.tez.client.TezSession.submitDAG(TezSession.java:149)
	at org.apache.tez.test.TestFaultTolerance.runDAGAndVerify(TestFaultTolerance.java:121)
	at org.apache.tez.test.TestFaultTolerance.testSixLevelsFailingDAGSuccess(TestFaultTolerance.java:283)

testBasicInputFailureWithExit(org.apache.tez.test.TestFaultTolerance)  Time elapsed: 0.009
sec  <<< ERROR!
java.lang.NullPointerException: null
	at org.apache.tez.client.TezClientUtils.setupDAGCredentials(TezClientUtils.java:278)
	at org.apache.tez.client.TezSession.submitDAG(TezSession.java:149)
	at org.apache.tez.test.TestFaultTolerance.runDAGAndVerify(TestFaultTolerance.java:121)
	at org.apache.tez.test.TestFaultTolerance.testBasicInputFailureWithExit(TestFaultTolerance.java:212)

testMultipleInputFailureWithoutExit(org.apache.tez.test.TestFaultTolerance)  Time elapsed:
0.011 sec  <<< ERROR!
java.lang.NullPointerException: null
	at org.apache.tez.client.TezClientUtils.setupDAGCredentials(TezClientUtils.java:278)
	at org.apache.tez.client.TezSession.submitDAG(TezSession.java:149)
	at org.apache.tez.test.TestFaultTolerance.runDAGAndVerify(TestFaultTolerance.java:121)
	at org.apache.tez.test.TestFaultTolerance.testMultipleInputFailureWithoutExit(TestFaultTolerance.java:244)

testBasicSuccessBroadcast(org.apache.tez.test.TestFaultTolerance)  Time elapsed: 0.014 sec
 <<< ERROR!
java.lang.NullPointerException: null
	at org.apache.tez.client.TezClientUtils.setupDAGCredentials(TezClientUtils.java:278)
	at org.apache.tez.client.TezSession.submitDAG(TezSession.java:149)
	at org.apache.tez.test.TestFaultTolerance.runDAGAndVerify(TestFaultTolerance.java:121)
	at org.apache.tez.test.TestFaultTolerance.testBasicSuccessBroadcast(TestFaultTolerance.java:152)

testTwoLevelsFailingDAGSuccess(org.apache.tez.test.TestFaultTolerance)  Time elapsed: 0.061
sec  <<< ERROR!
java.lang.NullPointerException: null
	at org.apache.tez.client.TezClientUtils.setupDAGCredentials(TezClientUtils.java:278)
	at org.apache.tez.client.TezSession.submitDAG(TezSession.java:149)
	at org.apache.tez.test.TestFaultTolerance.runDAGAndVerify(TestFaultTolerance.java:121)
	at org.apache.tez.test.TestFaultTolerance.testTwoLevelsFailingDAGSuccess(TestFaultTolerance.java:269)

Running org.apache.tez.mapreduce.TestMRRJobs
Tests run: 5, Failures: 0, Errors: 0, Skipped: 0, Time elapsed: 138.781 sec
Running org.apache.tez.mapreduce.TestMRRJobsDAGApi
Tests run: 8, Failures: 0, Errors: 1, Skipped: 0, Time elapsed: 132.286 sec <<< FAILURE!
testVertexGroups(org.apache.tez.mapreduce.TestMRRJobsDAGApi)  Time elapsed: 9.705 sec  <<<
ERROR!
java.lang.NullPointerException: null
	at org.apache.tez.client.TezClientUtils.setupDAGCredentials(TezClientUtils.java:278)
	at org.apache.tez.client.TezSession.submitDAG(TezSession.java:149)
	at org.apache.tez.mapreduce.examples.UnionExample.run(UnionExample.java:445)
	at org.apache.tez.mapreduce.TestMRRJobsDAGApi.testVertexGroups(TestMRRJobsDAGApi.java:553)


Results :

Tests in error: 
  TestFaultTolerance.testThreeLevelsFailingDAG2VerticesHaveFailedAttemptsDAGSucceeds:309->runDAGAndVerify:121
» NullPointer
  TestFaultTolerance.testMultiVersionInputFailureWithoutExit:262->runDAGAndVerify:121 »
NullPointer
  TestFaultTolerance.testTaskMultipleFailuresDAGFail:194->runDAGAndVerify:121 » NullPointer
  TestFaultTolerance.testTaskMultipleFailures:180->runDAGAndVerify:121 » NullPointer
  TestFaultTolerance.testInputFailureCausesRerunAttemptWithinMaxAttemptSuccess:357->runDAGAndVerify:121
» NullPointer
  TestFaultTolerance.testBasicInputFailureWithoutExit:228->runDAGAndVerify:121 » NullPointer
  TestFaultTolerance.testBasicTaskFailure:166->runDAGAndVerify:121 » NullPointer
  TestFaultTolerance.testBasicSuccessScatterGather:138->runDAGAndVerify:121 » NullPointer
  TestFaultTolerance.testThreeLevelsFailingDAGSuccess:276->runDAGAndVerify:121 » NullPointer
  TestFaultTolerance.testSixLevelsFailingDAGSuccess:283->runDAGAndVerify:121 » NullPointer
  TestFaultTolerance.testBasicInputFailureWithExit:212->runDAGAndVerify:121 » NullPointer
  TestFaultTolerance.testMultipleInputFailureWithoutExit:244->runDAGAndVerify:121 » NullPointer
  TestFaultTolerance.testBasicSuccessBroadcast:152->runDAGAndVerify:121 » NullPointer
  TestFaultTolerance.testTwoLevelsFailingDAGSuccess:269->runDAGAndVerify:121 » NullPointer
  TestMRRJobsDAGApi.testVertexGroups:553 » NullPointer

Tests run: 27, Failures: 0, Errors: 15, Skipped: 0

[INFO] ------------------------------------------------------------------------
[INFO] Reactor Summary:
[INFO] 
[INFO] tez ............................................... SUCCESS [2.852s]
[INFO] tez-api ........................................... SUCCESS [22.487s]
[INFO] tez-common ........................................ SUCCESS [2.805s]
[INFO] tez-runtime-internals ............................. SUCCESS [4.337s]
[INFO] tez-runtime-library ............................... SUCCESS [8.994s]
[INFO] tez-mapreduce ..................................... SUCCESS [17.427s]
[INFO] tez-mapreduce-examples ............................ SUCCESS [3.152s]
[INFO] tez-dag ........................................... SUCCESS [39.831s]
[INFO] tez-tests ......................................... FAILURE [4:59.631s]
[INFO] tez-dist .......................................... SKIPPED
[INFO] Tez ............................................... SKIPPED
[INFO] ------------------------------------------------------------------------
[INFO] BUILD FAILURE
[INFO] ------------------------------------------------------------------------
[INFO] Total time: 6:41.875s
[INFO] Finished at: Thu Feb 06 22:57:09 UTC 2014
[INFO] Final Memory: 29M/711M
[INFO] ------------------------------------------------------------------------
[ERROR] Failed to execute goal org.apache.maven.plugins:maven-surefire-plugin:2.14.1:test
(default-test) on project tez-tests: There are test failures.
[ERROR] 
[ERROR] Please refer to <https://builds.apache.org/job/Tez-Build/ws/tez-tests/target/surefire-reports>
for the individual test results.
[ERROR] -> [Help 1]
[ERROR] 
[ERROR] To see the full stack trace of the errors, re-run Maven with the -e switch.
[ERROR] Re-run Maven using the -X switch to enable full debug logging.
[ERROR] 
[ERROR] For more information about the errors and possible solutions, please read the following
articles:
[ERROR] [Help 1] http://cwiki.apache.org/confluence/display/MAVEN/MojoFailureException
[ERROR] 
[ERROR] After correcting the problems, you can resume the build with the command
[ERROR]   mvn <goals> -rf :tez-tests
Build step 'Execute shell' marked build as failure
Archiving artifacts
Recording test results

Mime
View raw message