tez-dev mailing list archives

Site index · List index
Message view « Date » · « Thread »
Top « Date » · « Thread »
From Apache Jenkins Server <jenk...@builds.apache.org>
Subject Build failed in Jenkins: Tez-Build #305
Date Sat, 15 Feb 2014 03:51:13 GMT
See <https://builds.apache.org/job/Tez-Build/305/changes>

Changes:

[bikas] TEZ-804. Handle node loss/bad nodes (bikas)

[sseth] TEZ-756. Allow VertexManagerPlugins to configure RootInputEvents without

[sseth] TEZ-840. Default value of DataMovementEventPayloadProto.data_generated

------------------------------------------
[...truncated 586 lines...]
[INFO] --- maven-compiler-plugin:3.1:testCompile (default-testCompile) @ tez-runtime-internals
---
[INFO] Changes detected - recompiling the module!
[INFO] Compiling 3 source files to <https://builds.apache.org/job/Tez-Build/ws/tez-runtime-internals/target/test-classes>
[INFO] 
[INFO] --- maven-surefire-plugin:2.14.1:test (default-test) @ tez-runtime-internals ---
[INFO] Surefire report directory: <https://builds.apache.org/job/Tez-Build/ws/tez-runtime-internals/target/surefire-reports>

-------------------------------------------------------
 T E S T S
-------------------------------------------------------

-------------------------------------------------------
 T E S T S
-------------------------------------------------------
Running org.apache.tez.runtime.common.resources.TestMemoryDistributor
Tests run: 5, Failures: 0, Errors: 0, Skipped: 0, Time elapsed: 0.736 sec
Running org.apache.tez.runtime.common.objectregistry.TestObjectRegistry
Tests run: 2, Failures: 0, Errors: 0, Skipped: 0, Time elapsed: 0.251 sec
Running org.apache.tez.runtime.TestRuntimeUtils
Tests run: 1, Failures: 0, Errors: 0, Skipped: 0, Time elapsed: 0.6 sec

Results :

Tests run: 8, Failures: 0, Errors: 0, Skipped: 0

[INFO] 
[INFO] --- hadoop-maven-plugins:2.2.0:protoc (compile-protoc) @ tez-runtime-internals ---
[INFO] 
[INFO] --- maven-resources-plugin:2.6:resources (default-resources) @ tez-runtime-internals
---
[INFO] Using 'UTF-8' encoding to copy filtered resources.
[INFO] skip non existing resourceDirectory <https://builds.apache.org/job/Tez-Build/ws/tez-runtime-internals/src/main/resources>
[INFO] 
[INFO] --- maven-compiler-plugin:3.1:compile (default-compile) @ tez-runtime-internals ---
[INFO] Changes detected - recompiling the module!
[INFO] Compiling 34 source files to <https://builds.apache.org/job/Tez-Build/ws/tez-runtime-internals/target/classes>
[INFO] 
[INFO] --- maven-resources-plugin:2.6:testResources (default-testResources) @ tez-runtime-internals
---
[INFO] Using 'UTF-8' encoding to copy filtered resources.
[INFO] skip non existing resourceDirectory <https://builds.apache.org/job/Tez-Build/ws/tez-runtime-internals/src/test/resources>
[INFO] 
[INFO] --- maven-compiler-plugin:3.1:testCompile (default-testCompile) @ tez-runtime-internals
---
[INFO] Nothing to compile - all classes are up to date
[INFO] 
[INFO] --- maven-surefire-plugin:2.14.1:test (default-test) @ tez-runtime-internals ---
[INFO] Skipping execution of surefire because it has already been run for this configuration
[INFO] 
[INFO] --- maven-jar-plugin:2.3.1:jar (default-jar) @ tez-runtime-internals ---
[INFO] Building jar: <https://builds.apache.org/job/Tez-Build/ws/tez-runtime-internals/target/tez-runtime-internals-0.3.0-incubating-SNAPSHOT.jar>
[INFO] 
[INFO] --- maven-jar-plugin:2.3.1:test-jar (default) @ tez-runtime-internals ---
[INFO] Building jar: <https://builds.apache.org/job/Tez-Build/ws/tez-runtime-internals/target/tez-runtime-internals-0.3.0-incubating-SNAPSHOT-tests.jar>
[INFO] 
[INFO] --- maven-install-plugin:2.3.1:install (default-install) @ tez-runtime-internals ---
[INFO] Installing <https://builds.apache.org/job/Tez-Build/ws/tez-runtime-internals/target/tez-runtime-internals-0.3.0-incubating-SNAPSHOT.jar>
to /home/jenkins/.m2/repository/org/apache/tez/tez-runtime-internals/0.3.0-incubating-SNAPSHOT/tez-runtime-internals-0.3.0-incubating-SNAPSHOT.jar
[INFO] Installing <https://builds.apache.org/job/Tez-Build/ws/tez-runtime-internals/pom.xml>
to /home/jenkins/.m2/repository/org/apache/tez/tez-runtime-internals/0.3.0-incubating-SNAPSHOT/tez-runtime-internals-0.3.0-incubating-SNAPSHOT.pom
[INFO] Installing <https://builds.apache.org/job/Tez-Build/ws/tez-runtime-internals/target/tez-runtime-internals-0.3.0-incubating-SNAPSHOT-tests.jar>
to /home/jenkins/.m2/repository/org/apache/tez/tez-runtime-internals/0.3.0-incubating-SNAPSHOT/tez-runtime-internals-0.3.0-incubating-SNAPSHOT-tests.jar
[INFO] 
[INFO] --- maven-deploy-plugin:2.8.1:deploy (default-deploy) @ tez-runtime-internals ---
Downloading: https://repository.apache.org/content/repositories/snapshots/org/apache/tez/tez-runtime-internals/0.3.0-incubating-SNAPSHOT/maven-metadata.xml
2 KB   
       
Downloaded: https://repository.apache.org/content/repositories/snapshots/org/apache/tez/tez-runtime-internals/0.3.0-incubating-SNAPSHOT/maven-metadata.xml
(2 KB at 1.0 KB/sec)
Uploading: https://repository.apache.org/content/repositories/snapshots/org/apache/tez/tez-runtime-internals/0.3.0-incubating-SNAPSHOT/tez-runtime-internals-0.3.0-incubating-20140215.035055-37.jar
4 KB   
8 KB   
12 KB   
16 KB   
20 KB   
24 KB   
28 KB   
32 KB   
36 KB   
40 KB   
44 KB   
48 KB   
52 KB   
56 KB   
60 KB   
64 KB   
68 KB   
72 KB   
76 KB   
80 KB   
84 KB   
88 KB   
92 KB   
96 KB   
100 KB   
104 KB   
107 KB   
         
Uploaded: https://repository.apache.org/content/repositories/snapshots/org/apache/tez/tez-runtime-internals/0.3.0-incubating-SNAPSHOT/tez-runtime-internals-0.3.0-incubating-20140215.035055-37.jar
(107 KB at 359.3 KB/sec)
Uploading: https://repository.apache.org/content/repositories/snapshots/org/apache/tez/tez-runtime-internals/0.3.0-incubating-SNAPSHOT/tez-runtime-internals-0.3.0-incubating-20140215.035055-37.pom
4 KB     
       
Uploaded: https://repository.apache.org/content/repositories/snapshots/org/apache/tez/tez-runtime-internals/0.3.0-incubating-SNAPSHOT/tez-runtime-internals-0.3.0-incubating-20140215.035055-37.pom
(4 KB at 23.3 KB/sec)
Downloading: https://repository.apache.org/content/repositories/snapshots/org/apache/tez/tez-runtime-internals/maven-metadata.xml
417 B   
        
Downloaded: https://repository.apache.org/content/repositories/snapshots/org/apache/tez/tez-runtime-internals/maven-metadata.xml
(417 B at 2.6 KB/sec)
Uploading: https://repository.apache.org/content/repositories/snapshots/org/apache/tez/tez-runtime-internals/0.3.0-incubating-SNAPSHOT/maven-metadata.xml
2 KB    
       
Uploaded: https://repository.apache.org/content/repositories/snapshots/org/apache/tez/tez-runtime-internals/0.3.0-incubating-SNAPSHOT/maven-metadata.xml
(2 KB at 4.7 KB/sec)
Uploading: https://repository.apache.org/content/repositories/snapshots/org/apache/tez/tez-runtime-internals/maven-metadata.xml
417 B   
        
Uploaded: https://repository.apache.org/content/repositories/snapshots/org/apache/tez/tez-runtime-internals/maven-metadata.xml
(417 B at 2.6 KB/sec)
Uploading: https://repository.apache.org/content/repositories/snapshots/org/apache/tez/tez-runtime-internals/0.3.0-incubating-SNAPSHOT/tez-runtime-internals-0.3.0-incubating-20140215.035055-37-tests.jar
4 KB    
8 KB   
11 KB   
        
Uploaded: https://repository.apache.org/content/repositories/snapshots/org/apache/tez/tez-runtime-internals/0.3.0-incubating-SNAPSHOT/tez-runtime-internals-0.3.0-incubating-20140215.035055-37-tests.jar
(11 KB at 71.7 KB/sec)
Uploading: https://repository.apache.org/content/repositories/snapshots/org/apache/tez/tez-runtime-internals/0.3.0-incubating-SNAPSHOT/maven-metadata.xml
2 KB    
       
Uploaded: https://repository.apache.org/content/repositories/snapshots/org/apache/tez/tez-runtime-internals/0.3.0-incubating-SNAPSHOT/maven-metadata.xml
(2 KB at 7.8 KB/sec)
[INFO] 
[INFO] --- hadoop-maven-plugins:2.2.0:protoc (compile-protoc) @ tez-runtime-internals ---
[INFO] 
[INFO] --- maven-resources-plugin:2.6:resources (default-resources) @ tez-runtime-internals
---
[INFO] Using 'UTF-8' encoding to copy filtered resources.
[INFO] skip non existing resourceDirectory <https://builds.apache.org/job/Tez-Build/ws/tez-runtime-internals/src/main/resources>
[INFO] 
[INFO] --- maven-compiler-plugin:3.1:compile (default-compile) @ tez-runtime-internals ---
[INFO] Changes detected - recompiling the module!
[INFO] Compiling 34 source files to <https://builds.apache.org/job/Tez-Build/ws/tez-runtime-internals/target/classes>
[INFO] 
[INFO] --- maven-resources-plugin:2.6:testResources (default-testResources) @ tez-runtime-internals
---
[INFO] Using 'UTF-8' encoding to copy filtered resources.
[INFO] skip non existing resourceDirectory <https://builds.apache.org/job/Tez-Build/ws/tez-runtime-internals/src/test/resources>
[INFO] 
[INFO] --- maven-compiler-plugin:3.1:testCompile (default-testCompile) @ tez-runtime-internals
---
[INFO] Nothing to compile - all classes are up to date
[INFO] 
[INFO] --- maven-surefire-plugin:2.14.1:test (default-test) @ tez-runtime-internals ---
[INFO] Skipping execution of surefire because it has already been run for this configuration
[INFO] 
[INFO] --- maven-jar-plugin:2.3.1:jar (default-jar) @ tez-runtime-internals ---
[INFO] Building jar: <https://builds.apache.org/job/Tez-Build/ws/tez-runtime-internals/target/tez-runtime-internals-0.3.0-incubating-SNAPSHOT.jar>
[INFO] 
[INFO] --- maven-jar-plugin:2.3.1:test-jar (default) @ tez-runtime-internals ---
[INFO] Building jar: <https://builds.apache.org/job/Tez-Build/ws/tez-runtime-internals/target/tez-runtime-internals-0.3.0-incubating-SNAPSHOT-tests.jar>
[INFO]                                                                         
[INFO] ------------------------------------------------------------------------
[INFO] Building tez-runtime-library 0.3.0-incubating-SNAPSHOT
[INFO] ------------------------------------------------------------------------
[INFO] 
[INFO] --- maven-clean-plugin:2.4.1:clean (default-clean) @ tez-runtime-library ---
[INFO] Deleting <https://builds.apache.org/job/Tez-Build/ws/tez-runtime-library/target>
[INFO] 
[INFO] --- hadoop-maven-plugins:2.2.0:protoc (compile-protoc) @ tez-runtime-library ---
[INFO] 
[INFO] --- maven-resources-plugin:2.6:resources (default-resources) @ tez-runtime-library
---
[INFO] Using 'UTF-8' encoding to copy filtered resources.
[INFO] skip non existing resourceDirectory <https://builds.apache.org/job/Tez-Build/ws/tez-runtime-library/src/main/resources>
[INFO] 
[INFO] --- maven-compiler-plugin:3.1:compile (default-compile) @ tez-runtime-library ---
[INFO] Changes detected - recompiling the module!
[INFO] Compiling 72 source files to <https://builds.apache.org/job/Tez-Build/ws/tez-runtime-library/target/classes>
[INFO] 
[INFO] --- maven-resources-plugin:2.6:testResources (default-testResources) @ tez-runtime-library
---
[INFO] Using 'UTF-8' encoding to copy filtered resources.
[INFO] skip non existing resourceDirectory <https://builds.apache.org/job/Tez-Build/ws/tez-runtime-library/src/test/resources>
[INFO] 
[INFO] --- maven-compiler-plugin:3.1:testCompile (default-testCompile) @ tez-runtime-library
---
[INFO] Changes detected - recompiling the module!
[INFO] Compiling 5 source files to <https://builds.apache.org/job/Tez-Build/ws/tez-runtime-library/target/test-classes>
[INFO] 
[INFO] --- maven-surefire-plugin:2.14.1:test (default-test) @ tez-runtime-library ---
[INFO] Surefire report directory: <https://builds.apache.org/job/Tez-Build/ws/tez-runtime-library/target/surefire-reports>

-------------------------------------------------------
 T E S T S
-------------------------------------------------------

-------------------------------------------------------
 T E S T S
-------------------------------------------------------
Running org.apache.tez.runtime.library.broadcast.input.TestBroadcastInputManager
Tests run: 1, Failures: 0, Errors: 0, Skipped: 0, Time elapsed: 0.619 sec
Running org.apache.tez.runtime.library.common.sort.impl.TestIFile
Tests run: 4, Failures: 0, Errors: 0, Skipped: 2, Time elapsed: 0.509 sec
Running org.apache.tez.runtime.library.output.TestOnFileUnorderedKVOutput
Tests run: 1, Failures: 0, Errors: 0, Skipped: 0, Time elapsed: 0.865 sec
Running org.apache.tez.dag.library.vertexmanager.TestShuffleVertexManager
Tests run: 2, Failures: 0, Errors: 1, Skipped: 0, Time elapsed: 0.625 sec <<< FAILURE!
testShuffleVertexManagerAutoParallelism(org.apache.tez.dag.library.vertexmanager.TestShuffleVertexManager)
 Time elapsed: 0.089 sec  <<< ERROR!
java.lang.NullPointerException: null
	at java.util.HashMap.putAll(HashMap.java:498)
	at org.apache.tez.dag.library.vertexmanager.TestShuffleVertexManager$2.answer(TestShuffleVertexManager.java:117)
	at org.mockito.internal.stubbing.StubbedInvocationMatcher.answer(StubbedInvocationMatcher.java:34)
	at org.mockito.internal.handler.MockHandlerImpl.handle(MockHandlerImpl.java:91)
	at org.mockito.internal.handler.NullResultGuardian.handle(NullResultGuardian.java:29)
	at org.mockito.internal.handler.InvocationNotifierHandler.handle(InvocationNotifierHandler.java:38)
	at org.mockito.internal.creation.MethodInterceptorFilter.intercept(MethodInterceptorFilter.java:51)
	at org.apache.tez.dag.api.VertexManagerPluginContext$$EnhancerByMockitoWithCGLIB$$4ad97ecf.setVertexParallelism(<generated>)
	at org.apache.tez.dag.library.vertexmanager.ShuffleVertexManager.determineParallelismAndApply(ShuffleVertexManager.java:359)
	at org.apache.tez.dag.library.vertexmanager.ShuffleVertexManager.schedulePendingTasks(ShuffleVertexManager.java:375)
	at org.apache.tez.dag.library.vertexmanager.ShuffleVertexManager.schedulePendingTasks(ShuffleVertexManager.java:444)
	at org.apache.tez.dag.library.vertexmanager.ShuffleVertexManager.onSourceTaskCompleted(ShuffleVertexManager.java:257)
	at org.apache.tez.dag.library.vertexmanager.TestShuffleVertexManager.testShuffleVertexManagerAutoParallelism(TestShuffleVertexManager.java:182)


Results :

Tests in error: 
  TestShuffleVertexManager.testShuffleVertexManagerAutoParallelism:182 ยป NullPointer

Tests run: 8, Failures: 0, Errors: 1, Skipped: 2

[INFO] ------------------------------------------------------------------------
[INFO] Reactor Summary:
[INFO] 
[INFO] tez ............................................... SUCCESS [3.391s]
[INFO] tez-api ........................................... SUCCESS [26.651s]
[INFO] tez-common ........................................ SUCCESS [5.647s]
[INFO] tez-runtime-internals ............................. SUCCESS [6.371s]
[INFO] tez-runtime-library ............................... FAILURE [4.839s]
[INFO] tez-mapreduce ..................................... SKIPPED
[INFO] tez-mapreduce-examples ............................ SKIPPED
[INFO] tez-dag ........................................... SKIPPED
[INFO] tez-tests ......................................... SKIPPED
[INFO] tez-dist .......................................... SKIPPED
[INFO] Tez ............................................... SKIPPED
[INFO] ------------------------------------------------------------------------
[INFO] BUILD FAILURE
[INFO] ------------------------------------------------------------------------
[INFO] Total time: 47.261s
[INFO] Finished at: Sat Feb 15 03:51:01 UTC 2014
[INFO] Final Memory: 22M/329M
[INFO] ------------------------------------------------------------------------
[ERROR] Failed to execute goal org.apache.maven.plugins:maven-surefire-plugin:2.14.1:test
(default-test) on project tez-runtime-library: There are test failures.
[ERROR] 
[ERROR] Please refer to <https://builds.apache.org/job/Tez-Build/ws/tez-runtime-library/target/surefire-reports>
for the individual test results.
[ERROR] -> [Help 1]
[ERROR] 
[ERROR] To see the full stack trace of the errors, re-run Maven with the -e switch.
[ERROR] Re-run Maven using the -X switch to enable full debug logging.
[ERROR] 
[ERROR] For more information about the errors and possible solutions, please read the following
articles:
[ERROR] [Help 1] http://cwiki.apache.org/confluence/display/MAVEN/MojoFailureException
[ERROR] 
[ERROR] After correcting the problems, you can resume the build with the command
[ERROR]   mvn <goals> -rf :tez-runtime-library
Build step 'Execute shell' marked build as failure
Archiving artifacts
Recording test results

Mime
View raw message