tez-dev mailing list archives

Site index · List index
Message view « Date » · « Thread »
Top « Date » · « Thread »
From Apache Jenkins Server <jenk...@builds.apache.org>
Subject Build failed in Jenkins: Tez-Build #286
Date Wed, 05 Feb 2014 22:07:21 GMT
See <https://builds.apache.org/job/Tez-Build/286/changes>

Changes:

[bikas] TEZ-773. Fix configuration of tez jars location in MiniTezCluster (bikas)

[bikas] TEZ-783. Add standard DAGs using failing processors/inputs for test purpose (Tassapol
Athiapinya via bikas)

[bikas] TEZ-745. Rename TEZ_AM_ABORT_ALL_OUTPUTS_ON_DAG_FAILURE in TezConfiguration to TEZ_AM_COMMIT_ALL_OUTPUTS_ON_DAG_SUCCESS
(Jonathan Eagles via bikas)

------------------------------------------
[...truncated 1606 lines...]
12/195 KB   
14/195 KB   
16/195 KB   
18/195 KB   
20/195 KB   
22/195 KB   
24/195 KB   
26/195 KB   
28/195 KB   
30/195 KB   
32/195 KB   
34/195 KB   
36/195 KB   
38/195 KB   
40/195 KB   
42/195 KB   
44/195 KB   
46/195 KB   
48/195 KB   
50/195 KB   
52/195 KB   
54/195 KB   
56/195 KB   
58/195 KB   
60/195 KB   
62/195 KB   
64/195 KB   
66/195 KB   
68/195 KB   
70/195 KB   
72/195 KB   
74/195 KB   
76/195 KB   
78/195 KB   
80/195 KB   
82/195 KB   
84/195 KB   
86/195 KB   
88/195 KB   
90/195 KB   
92/195 KB   
94/195 KB   
96/195 KB   
98/195 KB   
100/195 KB   
102/195 KB   
104/195 KB   
106/195 KB   
108/195 KB   
110/195 KB   
112/195 KB   
114/195 KB   
116/195 KB   
118/195 KB   
120/195 KB   
122/195 KB   
124/195 KB   
126/195 KB   
128/195 KB   
130/195 KB   
132/195 KB   
134/195 KB   
136/195 KB   
138/195 KB   
140/195 KB   
142/195 KB   
144/195 KB   
146/195 KB   
148/195 KB   
150/195 KB   
152/195 KB   
154/195 KB   
156/195 KB   
158/195 KB   
160/195 KB   
162/195 KB   
164/195 KB   
166/195 KB   
168/195 KB   
170/195 KB   
172/195 KB   
174/195 KB   
176/195 KB   
178/195 KB   
180/195 KB   
182/195 KB   
184/195 KB   
186/195 KB   
188/195 KB   
190/195 KB   
192/195 KB   
194/195 KB   
195/195 KB   
             
Uploaded: https://repository.apache.org/content/repositories/snapshots/org/apache/tez/tez-mapreduce-examples/0.3.0-incubating-SNAPSHOT/tez-mapreduce-examples-0.3.0-incubating-20140205.215140-18.jar
(195 KB at 374.7 KB/sec)
Uploading: https://repository.apache.org/content/repositories/snapshots/org/apache/tez/tez-mapreduce-examples/0.3.0-incubating-SNAPSHOT/tez-mapreduce-examples-0.3.0-incubating-20140205.215140-18.pom
2/3 KB       
3/3 KB   
         
Uploaded: https://repository.apache.org/content/repositories/snapshots/org/apache/tez/tez-mapreduce-examples/0.3.0-incubating-SNAPSHOT/tez-mapreduce-examples-0.3.0-incubating-20140205.215140-18.pom
(3 KB at 5.9 KB/sec)
Downloading: https://repository.apache.org/content/repositories/snapshots/org/apache/tez/tez-mapreduce-examples/maven-metadata.xml
418/418 B   
            
Downloaded: https://repository.apache.org/content/repositories/snapshots/org/apache/tez/tez-mapreduce-examples/maven-metadata.xml
(418 B at 2.2 KB/sec)
Uploading: https://repository.apache.org/content/repositories/snapshots/org/apache/tez/tez-mapreduce-examples/0.3.0-incubating-SNAPSHOT/maven-metadata.xml
2/2 KB      
         
Uploaded: https://repository.apache.org/content/repositories/snapshots/org/apache/tez/tez-mapreduce-examples/0.3.0-incubating-SNAPSHOT/maven-metadata.xml
(2 KB at 3.5 KB/sec)
Uploading: https://repository.apache.org/content/repositories/snapshots/org/apache/tez/tez-mapreduce-examples/maven-metadata.xml
418/418 B   
            
Uploaded: https://repository.apache.org/content/repositories/snapshots/org/apache/tez/tez-mapreduce-examples/maven-metadata.xml
(418 B at 1.2 KB/sec)
Uploading: https://repository.apache.org/content/repositories/snapshots/org/apache/tez/tez-mapreduce-examples/0.3.0-incubating-SNAPSHOT/tez-mapreduce-examples-0.3.0-incubating-20140205.215140-18-tests.jar
2/5 KB      
4/5 KB   
5/5 KB   
         
Uploaded: https://repository.apache.org/content/repositories/snapshots/org/apache/tez/tez-mapreduce-examples/0.3.0-incubating-SNAPSHOT/tez-mapreduce-examples-0.3.0-incubating-20140205.215140-18-tests.jar
(5 KB at 12.2 KB/sec)
Uploading: https://repository.apache.org/content/repositories/snapshots/org/apache/tez/tez-mapreduce-examples/0.3.0-incubating-SNAPSHOT/maven-metadata.xml
2/2 KB   
         
Uploaded: https://repository.apache.org/content/repositories/snapshots/org/apache/tez/tez-mapreduce-examples/0.3.0-incubating-SNAPSHOT/maven-metadata.xml
(2 KB at 3.0 KB/sec)
[INFO] 
[INFO] --- maven-resources-plugin:2.6:resources (default-resources) @ tez-mapreduce-examples
---
[INFO] Using 'UTF-8' encoding to copy filtered resources.
[INFO] skip non existing resourceDirectory <https://builds.apache.org/job/Tez-Build/ws/tez-mapreduce-examples/src/main/resources>
[INFO] 
[INFO] --- maven-compiler-plugin:3.1:compile (default-compile) @ tez-mapreduce-examples ---
[INFO] Nothing to compile - all classes are up to date
[INFO] 
[INFO] --- maven-resources-plugin:2.6:testResources (default-testResources) @ tez-mapreduce-examples
---
[INFO] Using 'UTF-8' encoding to copy filtered resources.
[INFO] skip non existing resourceDirectory <https://builds.apache.org/job/Tez-Build/ws/tez-mapreduce-examples/src/test/resources>
[INFO] 
[INFO] --- maven-compiler-plugin:3.1:testCompile (default-testCompile) @ tez-mapreduce-examples
---
[INFO] Nothing to compile - all classes are up to date
[INFO] 
[INFO] --- maven-surefire-plugin:2.14.1:test (default-test) @ tez-mapreduce-examples ---
[INFO] Skipping execution of surefire because it has already been run for this configuration
[INFO] 
[INFO] --- maven-jar-plugin:2.3.1:jar (default-jar) @ tez-mapreduce-examples ---
[INFO] Building jar: <https://builds.apache.org/job/Tez-Build/ws/tez-mapreduce-examples/target/tez-mapreduce-examples-0.3.0-incubating-SNAPSHOT.jar>
[INFO] 
[INFO] --- maven-jar-plugin:2.3.1:test-jar (default) @ tez-mapreduce-examples ---
[INFO] Building jar: <https://builds.apache.org/job/Tez-Build/ws/tez-mapreduce-examples/target/tez-mapreduce-examples-0.3.0-incubating-SNAPSHOT-tests.jar>
[INFO]                                                                         
[INFO] ------------------------------------------------------------------------
[INFO] Building tez-dag 0.3.0-incubating-SNAPSHOT
[INFO] ------------------------------------------------------------------------
[INFO] 
[INFO] --- maven-clean-plugin:2.4.1:clean (default-clean) @ tez-dag ---
[INFO] Deleting <https://builds.apache.org/job/Tez-Build/ws/tez-dag/target>
[INFO] 
[INFO] --- avro-maven-plugin:1.5.3:protocol (default) @ tez-dag ---
[INFO] 
[INFO] --- maven-resources-plugin:2.6:resources (default-resources) @ tez-dag ---
[INFO] Using 'UTF-8' encoding to copy filtered resources.
[INFO] Copying 2 resources
[INFO] 
[INFO] --- maven-compiler-plugin:3.1:compile (default-compile) @ tez-dag ---
[INFO] Changes detected - recompiling the module!
[INFO] Compiling 190 source files to <https://builds.apache.org/job/Tez-Build/ws/tez-dag/target/classes>
[WARNING] Note: Some input files use or override a deprecated API.
[WARNING] Note: Recompile with -Xlint:deprecation for details.
[INFO] 
[INFO] --- maven-resources-plugin:2.6:testResources (default-testResources) @ tez-dag ---
[INFO] Using 'UTF-8' encoding to copy filtered resources.
[INFO] Copying 1 resource
[INFO] 
[INFO] --- maven-compiler-plugin:3.1:testCompile (default-testCompile) @ tez-dag ---
[INFO] Changes detected - recompiling the module!
[INFO] Compiling 15 source files to <https://builds.apache.org/job/Tez-Build/ws/tez-dag/target/test-classes>
[WARNING] Note: <https://builds.apache.org/job/Tez-Build/ws/tez-dag/src/test/java/org/apache/tez/dag/app/rm/TestTezAMRMClient.java>
uses unchecked or unsafe operations.
[WARNING] Note: Recompile with -Xlint:unchecked for details.
[INFO] 
[INFO] --- maven-surefire-plugin:2.14.1:test (default-test) @ tez-dag ---
[INFO] Surefire report directory: <https://builds.apache.org/job/Tez-Build/ws/tez-dag/target/surefire-reports>

-------------------------------------------------------
 T E S T S
-------------------------------------------------------

-------------------------------------------------------
 T E S T S
-------------------------------------------------------
Running org.apache.tez.dag.api.client.TestVertexStatusBuilder
Tests run: 1, Failures: 0, Errors: 0, Skipped: 0, Time elapsed: 0.076 sec
Running org.apache.tez.dag.app.dag.impl.TestDAGScheduler
Tests run: 2, Failures: 0, Errors: 0, Skipped: 1, Time elapsed: 0.593 sec
Running org.apache.tez.dag.app.dag.impl.TestTaskAttempt
Tests run: 10, Failures: 0, Errors: 0, Skipped: 0, Time elapsed: 1.581 sec
Running org.apache.tez.dag.app.dag.impl.TestEdge
Tests run: 1, Failures: 0, Errors: 0, Skipped: 0, Time elapsed: 0.648 sec
Running org.apache.tez.dag.app.dag.impl.TestDAGImpl
Tests run: 18, Failures: 0, Errors: 0, Skipped: 2, Time elapsed: 3.972 sec
Running org.apache.tez.dag.app.dag.impl.TestTaskImpl
Tests run: 11, Failures: 0, Errors: 0, Skipped: 0, Time elapsed: 1.215 sec
Running org.apache.tez.dag.app.dag.impl.TestVertexImpl
Running org.apache.tez.dag.app.rm.container.TestAMContainer
Tests run: 24, Failures: 0, Errors: 0, Skipped: 0, Time elapsed: 0.984 sec
Running org.apache.tez.dag.app.rm.container.TestAMContainerMap
Tests run: 1, Failures: 0, Errors: 0, Skipped: 0, Time elapsed: 0.642 sec
Running org.apache.tez.dag.app.rm.TestContainerReuse
Tests run: 6, Failures: 0, Errors: 0, Skipped: 0, Time elapsed: 10.791 sec
Running org.apache.tez.dag.app.rm.node.TestAMNodeMap
Tests run: 2, Failures: 0, Errors: 0, Skipped: 0, Time elapsed: 0.552 sec
Running org.apache.tez.dag.app.rm.TestTezAMRMClient
Tests run: 1, Failures: 0, Errors: 0, Skipped: 0, Time elapsed: 0.661 sec
Running org.apache.tez.dag.app.rm.TestTaskScheduler
Tests run: 4, Failures: 0, Errors: 0, Skipped: 0, Time elapsed: 1.594 sec

Results :

Tests run: 81, Failures: 0, Errors: 0, Skipped: 3

[INFO] ------------------------------------------------------------------------
[INFO] Reactor Summary:
[INFO] 
[INFO] tez ............................................... SUCCESS [2.900s]
[INFO] tez-api ........................................... SUCCESS [24.693s]
[INFO] tez-common ........................................ SUCCESS [4.742s]
[INFO] tez-runtime-internals ............................. SUCCESS [5.882s]
[INFO] tez-runtime-library ............................... SUCCESS [10.081s]
[INFO] tez-mapreduce ..................................... SUCCESS [20.746s]
[INFO] tez-mapreduce-examples ............................ SUCCESS [4.518s]
[INFO] tez-dag ........................................... FAILURE [15:29.192s]
[INFO] tez-tests ......................................... SKIPPED
[INFO] tez-dist .......................................... SKIPPED
[INFO] Tez ............................................... SKIPPED
[INFO] ------------------------------------------------------------------------
[INFO] BUILD FAILURE
[INFO] ------------------------------------------------------------------------
[INFO] Total time: 16:43.213s
[INFO] Finished at: Wed Feb 05 22:07:12 UTC 2014
[INFO] Final Memory: 28M/410M
[INFO] ------------------------------------------------------------------------
[ERROR] Failed to execute goal org.apache.maven.plugins:maven-surefire-plugin:2.14.1:test
(default-test) on project tez-dag: There was a timeout or other error in the fork -> [Help
1]
[ERROR] 
[ERROR] To see the full stack trace of the errors, re-run Maven with the -e switch.
[ERROR] Re-run Maven using the -X switch to enable full debug logging.
[ERROR] 
[ERROR] For more information about the errors and possible solutions, please read the following
articles:
[ERROR] [Help 1] http://cwiki.apache.org/confluence/display/MAVEN/MojoFailureException
[ERROR] 
[ERROR] After correcting the problems, you can resume the build with the command
[ERROR]   mvn <goals> -rf :tez-dag
Build step 'Execute shell' marked build as failure
Archiving artifacts
Recording test results

Mime
View raw message