tez-dev mailing list archives

Site index · List index
Message view « Date » · « Thread »
Top « Date » · « Thread »
From Apache Jenkins Server <jenk...@builds.apache.org>
Subject Build failed in Jenkins: Tez-Build #362
Date Thu, 20 Mar 2014 01:35:07 GMT
See <https://builds.apache.org/job/Tez-Build/362/changes>

Changes:

[sseth] TEZ-952. Port MAPREDUCE-5209 and MAPREDUCE-5251. (sseth)

[hitesh] TEZ-958. Increase sleeps in TestContainerReuse to fix flaky tests. (hitesh)

[sseth] TEZ-953. Port MAPREDUCE-5493. (sseth)

[hitesh] TEZ-955. Tez should close inputs after calling processor's close. (hitesh)

------------------------------------------
[...truncated 1540 lines...]
[INFO] 
[INFO] --- maven-surefire-plugin:2.14.1:test (default-test) @ tez-mapreduce-examples ---
[INFO] Skipping execution of surefire because it has already been run for this configuration
[INFO] 
[INFO] --- maven-jar-plugin:2.4:jar (default-jar) @ tez-mapreduce-examples ---
[INFO] Building jar: <https://builds.apache.org/job/Tez-Build/ws/tez-mapreduce-examples/target/tez-mapreduce-examples-0.4.0-incubating-SNAPSHOT.jar>
[INFO] 
[INFO] --- maven-jar-plugin:2.4:test-jar (default) @ tez-mapreduce-examples ---
[INFO] Building jar: <https://builds.apache.org/job/Tez-Build/ws/tez-mapreduce-examples/target/tez-mapreduce-examples-0.4.0-incubating-SNAPSHOT-tests.jar>
[INFO] 
[INFO] --- maven-install-plugin:2.3.1:install (default-install) @ tez-mapreduce-examples ---
[INFO] Installing <https://builds.apache.org/job/Tez-Build/ws/tez-mapreduce-examples/target/tez-mapreduce-examples-0.4.0-incubating-SNAPSHOT.jar>
to /home/jenkins/.m2/repository/org/apache/tez/tez-mapreduce-examples/0.4.0-incubating-SNAPSHOT/tez-mapreduce-examples-0.4.0-incubating-SNAPSHOT.jar
[INFO] Installing <https://builds.apache.org/job/Tez-Build/ws/tez-mapreduce-examples/pom.xml>
to /home/jenkins/.m2/repository/org/apache/tez/tez-mapreduce-examples/0.4.0-incubating-SNAPSHOT/tez-mapreduce-examples-0.4.0-incubating-SNAPSHOT.pom
[INFO] Installing <https://builds.apache.org/job/Tez-Build/ws/tez-mapreduce-examples/target/tez-mapreduce-examples-0.4.0-incubating-SNAPSHOT-tests.jar>
to /home/jenkins/.m2/repository/org/apache/tez/tez-mapreduce-examples/0.4.0-incubating-SNAPSHOT/tez-mapreduce-examples-0.4.0-incubating-SNAPSHOT-tests.jar
[INFO] 
[INFO] --- maven-deploy-plugin:2.8.1:deploy (default-deploy) @ tez-mapreduce-examples ---
Downloading: https://repository.apache.org/content/repositories/snapshots/org/apache/tez/tez-mapreduce-examples/0.4.0-incubating-SNAPSHOT/maven-metadata.xml
2 KB   
       
Downloaded: https://repository.apache.org/content/repositories/snapshots/org/apache/tez/tez-mapreduce-examples/0.4.0-incubating-SNAPSHOT/maven-metadata.xml
(2 KB at 2.2 KB/sec)
Uploading: https://repository.apache.org/content/repositories/snapshots/org/apache/tez/tez-mapreduce-examples/0.4.0-incubating-SNAPSHOT/tez-mapreduce-examples-0.4.0-incubating-20140320.011918-37.jar
4 KB   
8 KB   
12 KB   
16 KB   
20 KB   
24 KB   
28 KB   
32 KB   
36 KB   
40 KB   
44 KB   
48 KB   
52 KB   
56 KB   
60 KB   
64 KB   
68 KB   
72 KB   
76 KB   
80 KB   
84 KB   
88 KB   
92 KB   
96 KB   
100 KB   
104 KB   
108 KB   
112 KB   
116 KB   
120 KB   
124 KB   
128 KB   
132 KB   
136 KB   
140 KB   
144 KB   
148 KB   
152 KB   
156 KB   
160 KB   
164 KB   
168 KB   
172 KB   
176 KB   
180 KB   
184 KB   
188 KB   
191 KB   
         
Uploaded: https://repository.apache.org/content/repositories/snapshots/org/apache/tez/tez-mapreduce-examples/0.4.0-incubating-SNAPSHOT/tez-mapreduce-examples-0.4.0-incubating-20140320.011918-37.jar
(191 KB at 485.5 KB/sec)
Uploading: https://repository.apache.org/content/repositories/snapshots/org/apache/tez/tez-mapreduce-examples/0.4.0-incubating-SNAPSHOT/tez-mapreduce-examples-0.4.0-incubating-20140320.011918-37.pom
3 KB     
       
Uploaded: https://repository.apache.org/content/repositories/snapshots/org/apache/tez/tez-mapreduce-examples/0.4.0-incubating-SNAPSHOT/tez-mapreduce-examples-0.4.0-incubating-20140320.011918-37.pom
(3 KB at 23.2 KB/sec)
Downloading: https://repository.apache.org/content/repositories/snapshots/org/apache/tez/tez-mapreduce-examples/maven-metadata.xml
418 B   
        
Downloaded: https://repository.apache.org/content/repositories/snapshots/org/apache/tez/tez-mapreduce-examples/maven-metadata.xml
(418 B at 4.7 KB/sec)
Uploading: https://repository.apache.org/content/repositories/snapshots/org/apache/tez/tez-mapreduce-examples/0.4.0-incubating-SNAPSHOT/maven-metadata.xml
2 KB    
       
Uploaded: https://repository.apache.org/content/repositories/snapshots/org/apache/tez/tez-mapreduce-examples/0.4.0-incubating-SNAPSHOT/maven-metadata.xml
(2 KB at 8.6 KB/sec)
Uploading: https://repository.apache.org/content/repositories/snapshots/org/apache/tez/tez-mapreduce-examples/maven-metadata.xml
418 B   
        
Uploaded: https://repository.apache.org/content/repositories/snapshots/org/apache/tez/tez-mapreduce-examples/maven-metadata.xml
(418 B at 3.5 KB/sec)
Uploading: https://repository.apache.org/content/repositories/snapshots/org/apache/tez/tez-mapreduce-examples/0.4.0-incubating-SNAPSHOT/tez-mapreduce-examples-0.4.0-incubating-20140320.011918-37-tests.jar
4 KB    
5 KB   
       
Uploaded: https://repository.apache.org/content/repositories/snapshots/org/apache/tez/tez-mapreduce-examples/0.4.0-incubating-SNAPSHOT/tez-mapreduce-examples-0.4.0-incubating-20140320.011918-37-tests.jar
(5 KB at 40.3 KB/sec)
Uploading: https://repository.apache.org/content/repositories/snapshots/org/apache/tez/tez-mapreduce-examples/0.4.0-incubating-SNAPSHOT/maven-metadata.xml
2 KB   
       
Uploaded: https://repository.apache.org/content/repositories/snapshots/org/apache/tez/tez-mapreduce-examples/0.4.0-incubating-SNAPSHOT/maven-metadata.xml
(2 KB at 8.8 KB/sec)
[INFO] 
[INFO] --- buildnumber-maven-plugin:1.1:create (default) @ tez-mapreduce-examples ---
[INFO] Checking for local modifications: skipped.
[INFO] Updating project files from SCM: skipped.
[INFO] Executing: /bin/sh -c cd <https://builds.apache.org/job/Tez-Build/ws/tez-mapreduce-examples>
&& git rev-parse --verify HEAD
[INFO] Working directory: <https://builds.apache.org/job/Tez-Build/ws/tez-mapreduce-examples>
[INFO] Storing buildNumber: 2775c8ad0ad4f1a4cfe1935b3233aa4007e06224 at timestamp: 1395278359946
[INFO] Executing: /bin/sh -c cd <https://builds.apache.org/job/Tez-Build/ws/tez-mapreduce-examples>
&& git rev-parse --verify HEAD
[INFO] Working directory: <https://builds.apache.org/job/Tez-Build/ws/tez-mapreduce-examples>
[INFO] Storing buildScmBranch: UNKNOWN
[INFO] 
[INFO] --- build-helper-maven-plugin:1.8:maven-version (maven-version) @ tez-mapreduce-examples
---
[INFO] 
[INFO] --- maven-resources-plugin:2.6:resources (default-resources) @ tez-mapreduce-examples
---
[INFO] Using 'UTF-8' encoding to copy filtered resources.
[INFO] skip non existing resourceDirectory <https://builds.apache.org/job/Tez-Build/ws/tez-mapreduce-examples/src/main/resources>
[INFO] 
[INFO] --- maven-compiler-plugin:3.1:compile (default-compile) @ tez-mapreduce-examples ---
[INFO] Nothing to compile - all classes are up to date
[INFO] 
[INFO] --- maven-resources-plugin:2.6:testResources (default-testResources) @ tez-mapreduce-examples
---
[INFO] Using 'UTF-8' encoding to copy filtered resources.
[INFO] skip non existing resourceDirectory <https://builds.apache.org/job/Tez-Build/ws/tez-mapreduce-examples/src/test/resources>
[INFO] 
[INFO] --- maven-compiler-plugin:3.1:testCompile (default-testCompile) @ tez-mapreduce-examples
---
[INFO] Nothing to compile - all classes are up to date
[INFO] 
[INFO] --- maven-surefire-plugin:2.14.1:test (default-test) @ tez-mapreduce-examples ---
[INFO] Skipping execution of surefire because it has already been run for this configuration
[INFO] 
[INFO] --- maven-jar-plugin:2.4:jar (default-jar) @ tez-mapreduce-examples ---
[INFO] Building jar: <https://builds.apache.org/job/Tez-Build/ws/tez-mapreduce-examples/target/tez-mapreduce-examples-0.4.0-incubating-SNAPSHOT.jar>
[INFO] 
[INFO] --- maven-jar-plugin:2.4:test-jar (default) @ tez-mapreduce-examples ---
[INFO] Building jar: <https://builds.apache.org/job/Tez-Build/ws/tez-mapreduce-examples/target/tez-mapreduce-examples-0.4.0-incubating-SNAPSHOT-tests.jar>
[INFO]                                                                         
[INFO] ------------------------------------------------------------------------
[INFO] Building tez-dag 0.4.0-incubating-SNAPSHOT
[INFO] ------------------------------------------------------------------------
[INFO] 
[INFO] --- maven-clean-plugin:2.4.1:clean (default-clean) @ tez-dag ---
[INFO] Deleting <https://builds.apache.org/job/Tez-Build/ws/tez-dag/target>
[INFO] 
[INFO] --- buildnumber-maven-plugin:1.1:create (default) @ tez-dag ---
[INFO] Checking for local modifications: skipped.
[INFO] Updating project files from SCM: skipped.
[INFO] Executing: /bin/sh -c cd <https://builds.apache.org/job/Tez-Build/ws/tez-dag>
&& git rev-parse --verify HEAD
[INFO] Working directory: <https://builds.apache.org/job/Tez-Build/ws/tez-dag>
[INFO] Storing buildNumber: 2775c8ad0ad4f1a4cfe1935b3233aa4007e06224 at timestamp: 1395278360620
[INFO] Executing: /bin/sh -c cd <https://builds.apache.org/job/Tez-Build/ws/tez-dag>
&& git rev-parse --verify HEAD
[INFO] Working directory: <https://builds.apache.org/job/Tez-Build/ws/tez-dag>
[INFO] Storing buildScmBranch: UNKNOWN
[INFO] 
[INFO] --- build-helper-maven-plugin:1.8:maven-version (maven-version) @ tez-dag ---
[INFO] 
[INFO] --- hadoop-maven-plugins:2.2.0:protoc (compile-protoc) @ tez-dag ---
[INFO] 
[INFO] --- maven-resources-plugin:2.6:resources (default-resources) @ tez-dag ---
[INFO] Using 'UTF-8' encoding to copy filtered resources.
[INFO] Copying 2 resources
[INFO] 
[INFO] --- maven-compiler-plugin:3.1:compile (default-compile) @ tez-dag ---
[INFO] Changes detected - recompiling the module!
[INFO] Compiling 196 source files to <https://builds.apache.org/job/Tez-Build/ws/tez-dag/target/classes>
[INFO] 
[INFO] --- maven-resources-plugin:2.6:testResources (default-testResources) @ tez-dag ---
[INFO] Using 'UTF-8' encoding to copy filtered resources.
[INFO] Copying 1 resource
[INFO] 
[INFO] --- maven-compiler-plugin:3.1:testCompile (default-testCompile) @ tez-dag ---
[INFO] Changes detected - recompiling the module!
[INFO] Compiling 17 source files to <https://builds.apache.org/job/Tez-Build/ws/tez-dag/target/test-classes>
[WARNING] Note: <https://builds.apache.org/job/Tez-Build/ws/tez-dag/src/test/java/org/apache/tez/dag/app/rm/TestTezAMRMClient.java>
uses unchecked or unsafe operations.
[WARNING] Note: Recompile with -Xlint:unchecked for details.
[INFO] 
[INFO] --- maven-surefire-plugin:2.14.1:test (default-test) @ tez-dag ---
[INFO] Surefire report directory: <https://builds.apache.org/job/Tez-Build/ws/tez-dag/target/surefire-reports>

-------------------------------------------------------
 T E S T S
-------------------------------------------------------

-------------------------------------------------------
 T E S T S
-------------------------------------------------------
Running org.apache.tez.dag.app.rm.TestTaskScheduler
Tests run: 4, Failures: 0, Errors: 0, Skipped: 0, Time elapsed: 1.469 sec
Running org.apache.tez.dag.app.rm.TestTezAMRMClient
Tests run: 1, Failures: 0, Errors: 0, Skipped: 0, Time elapsed: 0.637 sec
Running org.apache.tez.dag.app.rm.container.TestAMContainer
Tests run: 24, Failures: 0, Errors: 0, Skipped: 0, Time elapsed: 0.898 sec
Running org.apache.tez.dag.app.rm.container.TestAMContainerMap
Tests run: 1, Failures: 0, Errors: 0, Skipped: 0, Time elapsed: 0.628 sec
Running org.apache.tez.dag.app.rm.TestContainerReuse
Tests run: 6, Failures: 0, Errors: 0, Skipped: 0, Time elapsed: 19.713 sec
Running org.apache.tez.dag.app.rm.node.TestAMNodeMap
Tests run: 3, Failures: 0, Errors: 0, Skipped: 0, Time elapsed: 0.741 sec
Running org.apache.tez.dag.app.dag.impl.TestVertexStats
Tests run: 1, Failures: 0, Errors: 0, Skipped: 0, Time elapsed: 0.365 sec
Running org.apache.tez.dag.app.dag.impl.TestEdge
Tests run: 1, Failures: 0, Errors: 0, Skipped: 0, Time elapsed: 0.613 sec
Running org.apache.tez.dag.app.dag.impl.TestDAGImpl
Tests run: 18, Failures: 0, Errors: 0, Skipped: 2, Time elapsed: 2.344 sec
Running org.apache.tez.dag.app.dag.impl.TestDAGScheduler
Tests run: 2, Failures: 0, Errors: 0, Skipped: 1, Time elapsed: 0.561 sec
Running org.apache.tez.dag.app.dag.impl.TestTaskAttempt
Tests run: 10, Failures: 0, Errors: 0, Skipped: 0, Time elapsed: 1.415 sec
Running org.apache.tez.dag.app.dag.impl.TestTaskImpl
Tests run: 14, Failures: 0, Errors: 0, Skipped: 0, Time elapsed: 1.364 sec
Running org.apache.tez.dag.app.dag.impl.TestVertexImpl
Running org.apache.tez.dag.api.client.TestVertexStatusBuilder
Tests run: 1, Failures: 0, Errors: 0, Skipped: 0, Time elapsed: 0.074 sec
Running org.apache.tez.dag.history.events.TestHistoryEventsProtoConversion
Tests run: 1, Failures: 0, Errors: 0, Skipped: 0, Time elapsed: 0.656 sec

Results :

Tests run: 87, Failures: 0, Errors: 0, Skipped: 3

[INFO] ------------------------------------------------------------------------
[INFO] Reactor Summary:
[INFO] 
[INFO] tez ............................................... SUCCESS [5.324s]
[INFO] tez-api ........................................... SUCCESS [23.221s]
[INFO] tez-common ........................................ SUCCESS [3.086s]
[INFO] tez-runtime-internals ............................. SUCCESS [9.442s]
[INFO] tez-runtime-library ............................... SUCCESS [9.316s]
[INFO] tez-mapreduce ..................................... SUCCESS [18.118s]
[INFO] tez-mapreduce-examples ............................ SUCCESS [2.982s]
[INFO] tez-dag ........................................... FAILURE [15:38.437s]
[INFO] tez-tests ......................................... SKIPPED
[INFO] tez-dist .......................................... SKIPPED
[INFO] Tez ............................................... SKIPPED
[INFO] ------------------------------------------------------------------------
[INFO] BUILD FAILURE
[INFO] ------------------------------------------------------------------------
[INFO] Total time: 16:50.317s
[INFO] Finished at: Thu Mar 20 01:34:58 UTC 2014
[INFO] Final Memory: 29M/339M
[INFO] ------------------------------------------------------------------------
[ERROR] Failed to execute goal org.apache.maven.plugins:maven-surefire-plugin:2.14.1:test
(default-test) on project tez-dag: There was a timeout or other error in the fork -> [Help
1]
[ERROR] 
[ERROR] To see the full stack trace of the errors, re-run Maven with the -e switch.
[ERROR] Re-run Maven using the -X switch to enable full debug logging.
[ERROR] 
[ERROR] For more information about the errors and possible solutions, please read the following
articles:
[ERROR] [Help 1] http://cwiki.apache.org/confluence/display/MAVEN/MojoFailureException
[ERROR] 
[ERROR] After correcting the problems, you can resume the build with the command
[ERROR]   mvn <goals> -rf :tez-dag
Build step 'Execute shell' marked build as failure
Archiving artifacts
Recording test results

Mime
View raw message