tez-dev mailing list archives

Site index · List index
Message view « Date » · « Thread »
Top « Date » · « Thread »
From Apache Jenkins Server <jenk...@builds.apache.org>
Subject Build failed in Jenkins: Tez-Build #337
Date Sat, 01 Mar 2014 05:00:11 GMT
See <https://builds.apache.org/job/Tez-Build/337/changes>

Changes:

[hitesh] TEZ-906. Finalize Tez 0.3.0 release. (hitesh)

------------------------------------------
[...truncated 1605 lines...]
548 KB   
552 KB   
556 KB   
560 KB   
564 KB   
568 KB   
572 KB   
576 KB   
580 KB   
584 KB   
588 KB   
592 KB   
596 KB   
600 KB   
604 KB   
608 KB   
612 KB   
616 KB   
620 KB   
624 KB   
628 KB   
632 KB   
636 KB   
640 KB   
644 KB   
648 KB   
652 KB   
656 KB   
660 KB   
664 KB   
668 KB   
672 KB   
676 KB   
680 KB   
684 KB   
688 KB   
692 KB   
696 KB   
700 KB   
704 KB   
708 KB   
712 KB   
716 KB   
720 KB   
724 KB   
728 KB   
732 KB   
736 KB   
740 KB   
744 KB   
748 KB   
752 KB   
756 KB   
760 KB   
764 KB   
768 KB   
772 KB   
776 KB   
780 KB   
784 KB   
788 KB   
789 KB   
         
Uploaded: https://repository.apache.org/content/repositories/snapshots/org/apache/tez/tez-dag/0.4.0-incubating-SNAPSHOT/tez-dag-0.4.0-incubating-20140301.045131-9.jar
(789 KB at 1368.2 KB/sec)
Uploading: https://repository.apache.org/content/repositories/snapshots/org/apache/tez/tez-dag/0.4.0-incubating-SNAPSHOT/tez-dag-0.4.0-incubating-20140301.045131-9.pom
4 KB     
6 KB   
       
Uploaded: https://repository.apache.org/content/repositories/snapshots/org/apache/tez/tez-dag/0.4.0-incubating-SNAPSHOT/tez-dag-0.4.0-incubating-20140301.045131-9.pom
(6 KB at 43.5 KB/sec)
Downloading: https://repository.apache.org/content/repositories/snapshots/org/apache/tez/tez-dag/maven-metadata.xml
454 B   
        
Downloaded: https://repository.apache.org/content/repositories/snapshots/org/apache/tez/tez-dag/maven-metadata.xml
(454 B at 2.7 KB/sec)
Uploading: https://repository.apache.org/content/repositories/snapshots/org/apache/tez/tez-dag/0.4.0-incubating-SNAPSHOT/maven-metadata.xml
2 KB    
       
Uploaded: https://repository.apache.org/content/repositories/snapshots/org/apache/tez/tez-dag/0.4.0-incubating-SNAPSHOT/maven-metadata.xml
(2 KB at 5.5 KB/sec)
Uploading: https://repository.apache.org/content/repositories/snapshots/org/apache/tez/tez-dag/maven-metadata.xml
454 B   
        
Uploaded: https://repository.apache.org/content/repositories/snapshots/org/apache/tez/tez-dag/maven-metadata.xml
(454 B at 3.0 KB/sec)
Uploading: https://repository.apache.org/content/repositories/snapshots/org/apache/tez/tez-dag/0.4.0-incubating-SNAPSHOT/tez-dag-0.4.0-incubating-20140301.045131-9-tests.jar
4 KB    
8 KB   
12 KB   
16 KB   
20 KB   
24 KB   
28 KB   
32 KB   
36 KB   
40 KB   
44 KB   
48 KB   
52 KB   
56 KB   
60 KB   
64 KB   
68 KB   
72 KB   
76 KB   
80 KB   
84 KB   
88 KB   
92 KB   
96 KB   
100 KB   
104 KB   
108 KB   
112 KB   
116 KB   
120 KB   
124 KB   
128 KB   
132 KB   
136 KB   
140 KB   
144 KB   
148 KB   
152 KB   
156 KB   
160 KB   
         
Uploaded: https://repository.apache.org/content/repositories/snapshots/org/apache/tez/tez-dag/0.4.0-incubating-SNAPSHOT/tez-dag-0.4.0-incubating-20140301.045131-9-tests.jar
(160 KB at 942.7 KB/sec)
Uploading: https://repository.apache.org/content/repositories/snapshots/org/apache/tez/tez-dag/0.4.0-incubating-SNAPSHOT/maven-metadata.xml
2 KB     
       
Uploaded: https://repository.apache.org/content/repositories/snapshots/org/apache/tez/tez-dag/0.4.0-incubating-SNAPSHOT/maven-metadata.xml
(2 KB at 7.7 KB/sec)
[INFO] 
[INFO] --- hadoop-maven-plugins:2.2.0:protoc (compile-protoc) @ tez-dag ---
[INFO] 
[INFO] --- maven-resources-plugin:2.6:resources (default-resources) @ tez-dag ---
[INFO] Using 'UTF-8' encoding to copy filtered resources.
[INFO] Copying 2 resources
[INFO] 
[INFO] --- maven-compiler-plugin:3.1:compile (default-compile) @ tez-dag ---
[INFO] Changes detected - recompiling the module!
[INFO] Compiling 187 source files to <https://builds.apache.org/job/Tez-Build/ws/tez-dag/target/classes>
[INFO] 
[INFO] --- maven-resources-plugin:2.6:testResources (default-testResources) @ tez-dag ---
[INFO] Using 'UTF-8' encoding to copy filtered resources.
[INFO] Copying 1 resource
[INFO] 
[INFO] --- maven-compiler-plugin:3.1:testCompile (default-testCompile) @ tez-dag ---
[INFO] Nothing to compile - all classes are up to date
[INFO] 
[INFO] --- maven-surefire-plugin:2.14.1:test (default-test) @ tez-dag ---
[INFO] Skipping execution of surefire because it has already been run for this configuration
[INFO] 
[INFO] --- maven-jar-plugin:2.3.1:jar (default-jar) @ tez-dag ---
[INFO] Building jar: <https://builds.apache.org/job/Tez-Build/ws/tez-dag/target/tez-dag-0.4.0-incubating-SNAPSHOT.jar>
[INFO] 
[INFO] --- maven-jar-plugin:2.3.1:test-jar (default) @ tez-dag ---
[INFO] Building jar: <https://builds.apache.org/job/Tez-Build/ws/tez-dag/target/tez-dag-0.4.0-incubating-SNAPSHOT-tests.jar>
[INFO]                                                                         
[INFO] ------------------------------------------------------------------------
[INFO] Building tez-tests 0.4.0-incubating-SNAPSHOT
[INFO] ------------------------------------------------------------------------
[INFO] 
[INFO] --- maven-clean-plugin:2.4.1:clean (default-clean) @ tez-tests ---
[INFO] Deleting <https://builds.apache.org/job/Tez-Build/ws/tez-tests/target>
[INFO] 
[INFO] --- maven-resources-plugin:2.6:resources (default-resources) @ tez-tests ---
[INFO] Using 'UTF-8' encoding to copy filtered resources.
[INFO] skip non existing resourceDirectory <https://builds.apache.org/job/Tez-Build/ws/tez-tests/src/main/resources>
[INFO] 
[INFO] --- maven-compiler-plugin:3.1:compile (default-compile) @ tez-tests ---
[INFO] No sources to compile
[INFO] 
[INFO] --- maven-resources-plugin:2.6:testResources (default-testResources) @ tez-tests ---
[INFO] Using 'UTF-8' encoding to copy filtered resources.
[INFO] skip non existing resourceDirectory <https://builds.apache.org/job/Tez-Build/ws/tez-tests/src/test/resources>
[INFO] 
[INFO] --- maven-compiler-plugin:3.1:testCompile (default-testCompile) @ tez-tests ---
[INFO] Changes detected - recompiling the module!
[INFO] Compiling 17 source files to <https://builds.apache.org/job/Tez-Build/ws/tez-tests/target/test-classes>
[INFO] 
[INFO] --- maven-surefire-plugin:2.14.1:test (default-test) @ tez-tests ---
[INFO] Surefire report directory: <https://builds.apache.org/job/Tez-Build/ws/tez-tests/target/surefire-reports>

-------------------------------------------------------
 T E S T S
-------------------------------------------------------

-------------------------------------------------------
 T E S T S
-------------------------------------------------------
Running org.apache.tez.test.TestFaultTolerance
Tests run: 20, Failures: 1, Errors: 0, Skipped: 0, Time elapsed: 188.604 sec <<<
FAILURE!
testInputFailureCausesRerunAttemptWithinMaxAttemptSuccess(org.apache.tez.test.TestFaultTolerance)
 Time elapsed: 12.05 sec  <<< FAILURE!
java.lang.AssertionError: expected:<SUCCEEDED> but was:<FAILED>
	at org.junit.Assert.fail(Assert.java:88)
	at org.junit.Assert.failNotEquals(Assert.java:743)
	at org.junit.Assert.assertEquals(Assert.java:118)
	at org.junit.Assert.assertEquals(Assert.java:144)
	at org.apache.tez.test.TestFaultTolerance.runDAGAndVerify(TestFaultTolerance.java:145)
	at org.apache.tez.test.TestFaultTolerance.testInputFailureCausesRerunAttemptWithinMaxAttemptSuccess(TestFaultTolerance.java:452)

Running org.apache.tez.test.TestTezJobs
Tests run: 1, Failures: 0, Errors: 0, Skipped: 0, Time elapsed: 30.679 sec
Running org.apache.tez.mapreduce.TestMRRJobs
Tests run: 5, Failures: 0, Errors: 0, Skipped: 0, Time elapsed: 137.974 sec
Running org.apache.tez.mapreduce.TestMRRJobsDAGApi
Tests run: 8, Failures: 0, Errors: 0, Skipped: 0, Time elapsed: 148.209 sec

Results :

Failed tests: 
  TestFaultTolerance.testInputFailureCausesRerunAttemptWithinMaxAttemptSuccess:452->runDAGAndVerify:145
expected:<SUCCEEDED> but was:<FAILED>

Tests run: 34, Failures: 1, Errors: 0, Skipped: 0

[INFO] ------------------------------------------------------------------------
[INFO] Reactor Summary:
[INFO] 
[INFO] tez ............................................... SUCCESS [2.623s]
[INFO] tez-api ........................................... SUCCESS [22.253s]
[INFO] tez-common ........................................ SUCCESS [3.092s]
[INFO] tez-runtime-internals ............................. SUCCESS [9.865s]
[INFO] tez-runtime-library ............................... SUCCESS [8.865s]
[INFO] tez-mapreduce ..................................... SUCCESS [18.010s]
[INFO] tez-mapreduce-examples ............................ SUCCESS [3.109s]
[INFO] tez-dag ........................................... SUCCESS [37.530s]
[INFO] tez-tests ......................................... FAILURE [8:27.870s]
[INFO] tez-dist .......................................... SKIPPED
[INFO] Tez ............................................... SKIPPED
[INFO] ------------------------------------------------------------------------
[INFO] BUILD FAILURE
[INFO] ------------------------------------------------------------------------
[INFO] Total time: 10:13.568s
[INFO] Finished at: Sat Mar 01 05:00:03 UTC 2014
[INFO] Final Memory: 30M/668M
[INFO] ------------------------------------------------------------------------
[ERROR] Failed to execute goal org.apache.maven.plugins:maven-surefire-plugin:2.14.1:test
(default-test) on project tez-tests: There are test failures.
[ERROR] 
[ERROR] Please refer to <https://builds.apache.org/job/Tez-Build/ws/tez-tests/target/surefire-reports>
for the individual test results.
[ERROR] -> [Help 1]
[ERROR] 
[ERROR] To see the full stack trace of the errors, re-run Maven with the -e switch.
[ERROR] Re-run Maven using the -X switch to enable full debug logging.
[ERROR] 
[ERROR] For more information about the errors and possible solutions, please read the following
articles:
[ERROR] [Help 1] http://cwiki.apache.org/confluence/display/MAVEN/MojoFailureException
[ERROR] 
[ERROR] After correcting the problems, you can resume the build with the command
[ERROR]   mvn <goals> -rf :tez-tests
Build step 'Execute shell' marked build as failure
Archiving artifacts
Recording test results

Mime
View raw message