tez-dev mailing list archives

Site index · List index
Message view « Date » · « Thread »
Top « Date » · « Thread »
From Apache Jenkins Server <jenk...@builds.apache.org>
Subject Build failed in Jenkins: Tez-Build #418
Date Mon, 28 Apr 2014 20:21:59 GMT
See <https://builds.apache.org/job/Tez-Build/418/changes>

Changes:

[sseth] TEZ-1074. Reduce the frequency at which counters are sent from the task

------------------------------------------
[...truncated 2028 lines...]
852 KB   
856 KB   
860 KB   
864 KB   
868 KB   
872 KB   
876 KB   
880 KB   
884 KB   
888 KB   
892 KB   
896 KB   
900 KB   
904 KB   
908 KB   
912 KB   
916 KB   
920 KB   
924 KB   
928 KB   
932 KB   
936 KB   
940 KB   
944 KB   
948 KB   
952 KB   
956 KB   
960 KB   
963 KB   
         
Uploaded: https://repository.apache.org/content/repositories/snapshots/org/apache/tez/tez-dag/0.5.0-incubating-SNAPSHOT/tez-dag-0.5.0-incubating-20140428.200910-18.jar
(963 KB at 795.3 KB/sec)
Uploading: https://repository.apache.org/content/repositories/snapshots/org/apache/tez/tez-dag/0.5.0-incubating-SNAPSHOT/tez-dag-0.5.0-incubating-20140428.200910-18.pom
4 KB     
6 KB   
       
Uploaded: https://repository.apache.org/content/repositories/snapshots/org/apache/tez/tez-dag/0.5.0-incubating-SNAPSHOT/tez-dag-0.5.0-incubating-20140428.200910-18.pom
(6 KB at 40.8 KB/sec)
Downloading: https://repository.apache.org/content/repositories/snapshots/org/apache/tez/tez-dag/maven-metadata.xml
403 B   
        
Downloaded: https://repository.apache.org/content/repositories/snapshots/org/apache/tez/tez-dag/maven-metadata.xml
(403 B at 2.1 KB/sec)
Uploading: https://repository.apache.org/content/repositories/snapshots/org/apache/tez/tez-dag/0.5.0-incubating-SNAPSHOT/maven-metadata.xml
2 KB    
       
Uploaded: https://repository.apache.org/content/repositories/snapshots/org/apache/tez/tez-dag/0.5.0-incubating-SNAPSHOT/maven-metadata.xml
(2 KB at 4.7 KB/sec)
Uploading: https://repository.apache.org/content/repositories/snapshots/org/apache/tez/tez-dag/maven-metadata.xml
403 B   
        
Uploaded: https://repository.apache.org/content/repositories/snapshots/org/apache/tez/tez-dag/maven-metadata.xml
(403 B at 1.8 KB/sec)
Uploading: https://repository.apache.org/content/repositories/snapshots/org/apache/tez/tez-dag/0.5.0-incubating-SNAPSHOT/tez-dag-0.5.0-incubating-20140428.200910-18-tests.jar
4 KB    
8 KB   
12 KB   
16 KB   
20 KB   
24 KB   
28 KB   
32 KB   
36 KB   
40 KB   
44 KB   
48 KB   
52 KB   
56 KB   
60 KB   
64 KB   
68 KB   
72 KB   
76 KB   
80 KB   
84 KB   
88 KB   
92 KB   
96 KB   
100 KB   
104 KB   
108 KB   
112 KB   
116 KB   
120 KB   
124 KB   
128 KB   
132 KB   
136 KB   
140 KB   
144 KB   
148 KB   
152 KB   
156 KB   
160 KB   
164 KB   
168 KB   
172 KB   
176 KB   
179 KB   
         
Uploaded: https://repository.apache.org/content/repositories/snapshots/org/apache/tez/tez-dag/0.5.0-incubating-SNAPSHOT/tez-dag-0.5.0-incubating-20140428.200910-18-tests.jar
(179 KB at 588.4 KB/sec)
Uploading: https://repository.apache.org/content/repositories/snapshots/org/apache/tez/tez-dag/0.5.0-incubating-SNAPSHOT/maven-metadata.xml
2 KB     
       
Uploaded: https://repository.apache.org/content/repositories/snapshots/org/apache/tez/tez-dag/0.5.0-incubating-SNAPSHOT/maven-metadata.xml
(2 KB at 7.2 KB/sec)
[INFO] 
[INFO] --- buildnumber-maven-plugin:1.1:create (default) @ tez-dag ---
[INFO] Checking for local modifications: skipped.
[INFO] Updating project files from SCM: skipped.
[INFO] Executing: /bin/sh -c cd <https://builds.apache.org/job/Tez-Build/ws/tez-dag>
&& git rev-parse --verify HEAD
[INFO] Working directory: <https://builds.apache.org/job/Tez-Build/ws/tez-dag>
[INFO] Storing buildNumber: 083555aca45aae6cf1f113d08b3e9e3c3726117c at timestamp: 1398715752910
[INFO] Executing: /bin/sh -c cd <https://builds.apache.org/job/Tez-Build/ws/tez-dag>
&& git rev-parse --verify HEAD
[INFO] Working directory: <https://builds.apache.org/job/Tez-Build/ws/tez-dag>
[INFO] Storing buildScmBranch: UNKNOWN
[INFO] 
[INFO] --- build-helper-maven-plugin:1.8:maven-version (maven-version) @ tez-dag ---
[INFO] 
[INFO] --- hadoop-maven-plugins:2.2.0:protoc (compile-protoc) @ tez-dag ---
[INFO] 
[INFO] --- maven-resources-plugin:2.6:resources (default-resources) @ tez-dag ---
[INFO] Using 'UTF-8' encoding to copy filtered resources.
[INFO] Copying 1 resource
[INFO] 
[INFO] --- maven-compiler-plugin:3.1:compile (default-compile) @ tez-dag ---
[INFO] Changes detected - recompiling the module!
[INFO] Compiling 199 source files to <https://builds.apache.org/job/Tez-Build/ws/tez-dag/target/classes>
[INFO] 
[INFO] --- maven-resources-plugin:2.6:testResources (default-testResources) @ tez-dag ---
[INFO] Using 'UTF-8' encoding to copy filtered resources.
[INFO] Copying 1 resource
[INFO] 
[INFO] --- maven-compiler-plugin:3.1:testCompile (default-testCompile) @ tez-dag ---
[INFO] Nothing to compile - all classes are up to date
[INFO] 
[INFO] --- maven-surefire-plugin:2.14.1:test (default-test) @ tez-dag ---
[INFO] Skipping execution of surefire because it has already been run for this configuration
[INFO] 
[INFO] --- maven-jar-plugin:2.4:jar (default-jar) @ tez-dag ---
[INFO] Building jar: <https://builds.apache.org/job/Tez-Build/ws/tez-dag/target/tez-dag-0.5.0-incubating-SNAPSHOT.jar>
[INFO] 
[INFO] --- maven-jar-plugin:2.4:test-jar (default) @ tez-dag ---
[INFO] Building jar: <https://builds.apache.org/job/Tez-Build/ws/tez-dag/target/tez-dag-0.5.0-incubating-SNAPSHOT-tests.jar>
[INFO]                                                                         
[INFO] ------------------------------------------------------------------------
[INFO] Building tez-tests 0.5.0-incubating-SNAPSHOT
[INFO] ------------------------------------------------------------------------
[INFO] 
[INFO] --- maven-clean-plugin:2.4.1:clean (default-clean) @ tez-tests ---
[INFO] Deleting <https://builds.apache.org/job/Tez-Build/ws/tez-tests/target>
[INFO] 
[INFO] --- buildnumber-maven-plugin:1.1:create (default) @ tez-tests ---
[INFO] Checking for local modifications: skipped.
[INFO] Updating project files from SCM: skipped.
[INFO] Executing: /bin/sh -c cd <https://builds.apache.org/job/Tez-Build/ws/tez-tests>
&& git rev-parse --verify HEAD
[INFO] Working directory: <https://builds.apache.org/job/Tez-Build/ws/tez-tests>
[INFO] Storing buildNumber: 083555aca45aae6cf1f113d08b3e9e3c3726117c at timestamp: 1398715757382
[INFO] Executing: /bin/sh -c cd <https://builds.apache.org/job/Tez-Build/ws/tez-tests>
&& git rev-parse --verify HEAD
[INFO] Working directory: <https://builds.apache.org/job/Tez-Build/ws/tez-tests>
[INFO] Storing buildScmBranch: UNKNOWN
[INFO] 
[INFO] --- build-helper-maven-plugin:1.8:maven-version (maven-version) @ tez-tests ---
[INFO] 
[INFO] --- maven-resources-plugin:2.6:resources (default-resources) @ tez-tests ---
[INFO] Using 'UTF-8' encoding to copy filtered resources.
[INFO] skip non existing resourceDirectory <https://builds.apache.org/job/Tez-Build/ws/tez-tests/src/main/resources>
[INFO] 
[INFO] --- maven-compiler-plugin:3.1:compile (default-compile) @ tez-tests ---
[INFO] No sources to compile
[INFO] 
[INFO] --- maven-resources-plugin:2.6:testResources (default-testResources) @ tez-tests ---
[INFO] Using 'UTF-8' encoding to copy filtered resources.
[INFO] skip non existing resourceDirectory <https://builds.apache.org/job/Tez-Build/ws/tez-tests/src/test/resources>
[INFO] 
[INFO] --- maven-compiler-plugin:3.1:testCompile (default-testCompile) @ tez-tests ---
[INFO] Changes detected - recompiling the module!
[INFO] Compiling 20 source files to <https://builds.apache.org/job/Tez-Build/ws/tez-tests/target/test-classes>
[INFO] 
[INFO] --- maven-surefire-plugin:2.14.1:test (default-test) @ tez-tests ---
[INFO] Surefire report directory: <https://builds.apache.org/job/Tez-Build/ws/tez-tests/target/surefire-reports>

-------------------------------------------------------
 T E S T S
-------------------------------------------------------

-------------------------------------------------------
 T E S T S
-------------------------------------------------------
Running org.apache.tez.test.TestDAGRecovery2
Tests run: 1, Failures: 0, Errors: 0, Skipped: 0, Time elapsed: 63.448 sec
Running org.apache.tez.test.TestDAGRecovery
Tests run: 2, Failures: 0, Errors: 0, Skipped: 0, Time elapsed: 101.377 sec
Running org.apache.tez.test.TestTezJobs
Tests run: 2, Failures: 0, Errors: 0, Skipped: 0, Time elapsed: 44.379 sec
Running org.apache.tez.test.TestFaultTolerance
Tests run: 20, Failures: 1, Errors: 0, Skipped: 0, Time elapsed: 181.052 sec <<<
FAILURE!
testInputFailureCausesRerunAttemptWithinMaxAttemptSuccess(org.apache.tez.test.TestFaultTolerance)
 Time elapsed: 12.249 sec  <<< FAILURE!
java.lang.AssertionError: expected:<SUCCEEDED> but was:<FAILED>
	at org.junit.Assert.fail(Assert.java:88)
	at org.junit.Assert.failNotEquals(Assert.java:743)
	at org.junit.Assert.assertEquals(Assert.java:118)
	at org.junit.Assert.assertEquals(Assert.java:144)
	at org.apache.tez.test.TestFaultTolerance.runDAGAndVerify(TestFaultTolerance.java:145)
	at org.apache.tez.test.TestFaultTolerance.testInputFailureCausesRerunAttemptWithinMaxAttemptSuccess(TestFaultTolerance.java:452)

Running org.apache.tez.mapreduce.TestMRRJobs
Tests run: 5, Failures: 0, Errors: 0, Skipped: 0, Time elapsed: 138.178 sec
Running org.apache.tez.mapreduce.TestMRRJobsDAGApi
Tests run: 11, Failures: 0, Errors: 0, Skipped: 0, Time elapsed: 196.759 sec

Results :

Failed tests: 
  TestFaultTolerance.testInputFailureCausesRerunAttemptWithinMaxAttemptSuccess:452->runDAGAndVerify:145
expected:<SUCCEEDED> but was:<FAILED>

Tests run: 41, Failures: 1, Errors: 0, Skipped: 0

[INFO] ------------------------------------------------------------------------
[INFO] Reactor Summary:
[INFO] 
[INFO] tez ............................................... SUCCESS [4.569s]
[INFO] tez-api ........................................... SUCCESS [24.949s]
[INFO] tez-common ........................................ SUCCESS [3.260s]
[INFO] tez-runtime-internals ............................. SUCCESS [10.878s]
[INFO] tez-runtime-library ............................... SUCCESS [12.433s]
[INFO] tez-mapreduce ..................................... SUCCESS [19.620s]
[INFO] tez-mapreduce-examples ............................ SUCCESS [3.078s]
[INFO] tez-dag ........................................... SUCCESS [53.365s]
[INFO] tez-tests ......................................... FAILURE [12:08.981s]
[INFO] tez-dist .......................................... SKIPPED
[INFO] Tez ............................................... SKIPPED
[INFO] ------------------------------------------------------------------------
[INFO] BUILD FAILURE
[INFO] ------------------------------------------------------------------------
[INFO] Total time: 14:21.605s
[INFO] Finished at: Mon Apr 28 20:21:24 UTC 2014
[INFO] Final Memory: 31M/587M
[INFO] ------------------------------------------------------------------------
[ERROR] Failed to execute goal org.apache.maven.plugins:maven-surefire-plugin:2.14.1:test
(default-test) on project tez-tests: There are test failures.
[ERROR] 
[ERROR] Please refer to <https://builds.apache.org/job/Tez-Build/ws/tez-tests/target/surefire-reports>
for the individual test results.
[ERROR] -> [Help 1]
[ERROR] 
[ERROR] To see the full stack trace of the errors, re-run Maven with the -e switch.
[ERROR] Re-run Maven using the -X switch to enable full debug logging.
[ERROR] 
[ERROR] For more information about the errors and possible solutions, please read the following
articles:
[ERROR] [Help 1] http://cwiki.apache.org/confluence/display/MAVEN/MojoFailureException
[ERROR] 
[ERROR] After correcting the problems, you can resume the build with the command
[ERROR]   mvn <goals> -rf :tez-tests
Build step 'Execute shell' marked build as failure
Archiving artifacts
Recording test results

Mime
View raw message