tez-dev mailing list archives

Site index · List index
Message view « Date » · « Thread »
Top « Date » · « Thread »
From Apache Jenkins Server <jenk...@builds.apache.org>
Subject Build failed in Jenkins: Tez-Build #453
Date Wed, 18 Jun 2014 02:04:43 GMT
See <https://builds.apache.org/job/Tez-Build/453/changes>

Changes:

[hitesh] TEZ-1106. Tez framework should use a unique subdir for staging data. (Mohammad Kamrul
Islam via hitesh)

------------------------------------------
Started by an SCM change
Building remotely on hadoop9 (hadoop Hadoop Zookeeper Hadoop9) in workspace <https://builds.apache.org/job/Tez-Build/ws/>
 > git rev-parse --is-inside-work-tree
Fetching changes from the remote Git repository
 > git config remote.origin.url http://git-wip-us.apache.org/repos/asf/incubator-tez.git
Fetching upstream changes from http://git-wip-us.apache.org/repos/asf/incubator-tez.git
 > git --version
 > git fetch --tags --progress http://git-wip-us.apache.org/repos/asf/incubator-tez.git
+refs/heads/*:refs/remotes/origin/*
 > git rev-parse origin/master^{commit}
Checking out Revision b25c8668d32fdc4839c5bae1358f4d8396160bd7 (origin/master)
 > git config core.sparsecheckout
 > git checkout -f b25c8668d32fdc4839c5bae1358f4d8396160bd7
 > git rev-list aed87d2dbf1ce99a53eb2e919934dff9b8517e01
[Tez-Build] $ /bin/bash -x /tmp/hudson7043883344971973729.sh
+ export JAVA_HOME=/home/hudson/tools/java/latest
+ JAVA_HOME=/home/hudson/tools/java/latest
+ export MAVEN_HOME=/home/hudson/tools/maven/latest
+ MAVEN_HOME=/home/hudson/tools/maven/latest
+ export PATH=/home/hudson/tools/java/latest/bin:/home/hudson/tools/maven/latest/bin:/home/hudson/tools/java/latest1.6/bin:/home/hudson/tools/java/latest1.6/bin:/usr/local/sbin:/usr/local/bin:/usr/sbin:/usr/bin:/sbin:/bin:/usr/games
+ PATH=/home/hudson/tools/java/latest/bin:/home/hudson/tools/maven/latest/bin:/home/hudson/tools/java/latest1.6/bin:/home/hudson/tools/java/latest1.6/bin:/usr/local/sbin:/usr/local/bin:/usr/sbin:/usr/bin:/sbin:/bin:/usr/games
+ env
BUILD_URL=https://builds.apache.org/job/Tez-Build/453/
HUDSON_SERVER_COOKIE=f4ebd1e6b0d976e8
SHELL=/bin/bash
SSH_CLIENT=140.211.11.14 39378 22
BUILD_TAG=jenkins-Tez-Build-453
GIT_PREVIOUS_COMMIT=aed87d2dbf1ce99a53eb2e919934dff9b8517e01
WORKSPACE=<https://builds.apache.org/job/Tez-Build/ws/>
JOB_URL=https://builds.apache.org/job/Tez-Build/
USER=jenkins
LD_LIBRARY_PATH=/home/jenkins/tools/java/jdk1.6.0_26/jre/lib/i386/server:/home/jenkins/tools/java/jdk1.6.0_26/jre/lib/i386:/home/jenkins/tools/java/jdk1.6.0_26/jre/../lib/i386
NLSPATH=/usr/dt/lib/nls/msg/%L/%N.cat
GIT_COMMIT=b25c8668d32fdc4839c5bae1358f4d8396160bd7
JENKINS_HOME=/x1/jenkins/jenkins-home
MAVEN_HOME=/home/hudson/tools/maven/latest
PATH=/home/hudson/tools/java/latest/bin:/home/hudson/tools/maven/latest/bin:/home/hudson/tools/java/latest1.6/bin:/home/hudson/tools/java/latest1.6/bin:/usr/local/sbin:/usr/local/bin:/usr/sbin:/usr/bin:/sbin:/bin:/usr/games
MAIL=/var/mail/jenkins
PWD=<https://builds.apache.org/job/Tez-Build/ws/>
JAVA_HOME=/home/hudson/tools/java/latest
HUDSON_URL=https://builds.apache.org/
LANG=en_US
JOB_NAME=Tez-Build
BUILD_DISPLAY_NAME=#453
XFILESEARCHPATH=/usr/dt/app-defaults/%L/Dt
JENKINS_URL=https://builds.apache.org/
BUILD_ID=2014-06-18_02-03-57
HOME=/home/jenkins
SHLVL=2
GIT_BRANCH=origin/master
JENKINS_SERVER_COOKIE=f4ebd1e6b0d976e8
EXECUTOR_NUMBER=0
GIT_URL=http://git-wip-us.apache.org/repos/asf/incubator-tez.git
NODE_LABELS=Hadoop Hadoop9 Zookeeper hadoop hadoop9
LOGNAME=jenkins
HUDSON_HOME=/x1/jenkins/jenkins-home
SSH_CONNECTION=140.211.11.14 39378 67.195.138.22 22
NODE_NAME=hadoop9
BUILD_NUMBER=453
HUDSON_COOKIE=89c287e5-8964-429f-b2ff-cccf4f062795
_=/usr/bin/env
+ export MAVEN_OPTS=-Xmx2048m
+ MAVEN_OPTS=-Xmx2048m
+ /home/hudson/tools/maven/latest/bin/mvn clean test deploy package -Dtar
[INFO] Scanning for projects...
[WARNING] 
[WARNING] Some problems were encountered while building the effective model for org.apache.tez:tez-api:jar:0.5.0-incubating-SNAPSHOT
[WARNING] 'build.pluginManagement.plugins.plugin.(groupId:artifactId)' must be unique but
found duplicate declaration of plugin org.codehaus.mojo:findbugs-maven-plugin @ org.apache.tez:tez:0.5.0-incubating-SNAPSHOT,
<https://builds.apache.org/job/Tez-Build/ws/pom.xml,> line 497, column 17
[WARNING] 
[WARNING] Some problems were encountered while building the effective model for org.apache.tez:tez:pom:0.5.0-incubating-SNAPSHOT
[WARNING] 'build.pluginManagement.plugins.plugin.(groupId:artifactId)' must be unique but
found duplicate declaration of plugin org.codehaus.mojo:findbugs-maven-plugin @ line 497,
column 17
[WARNING] 
[WARNING] It is highly recommended to fix these problems because they threaten the stability
of your build.
[WARNING] 
[WARNING] For this reason, future Maven versions might no longer support building such malformed
projects.
[WARNING] 
[INFO] ------------------------------------------------------------------------
[INFO] Reactor Build Order:
[INFO] 
[INFO] tez
[INFO] tez-api
[INFO] tez-common
[INFO] tez-runtime-internals
[INFO] tez-runtime-library
[INFO] tez-mapreduce
[INFO] tez-mapreduce-examples
[INFO] tez-dag
[INFO] tez-tests
[INFO] tez-plugins
[INFO] tez-yarn-timeline-history
[INFO] tez-dist
[INFO] Tez
[INFO]                                                                         
[INFO] ------------------------------------------------------------------------
[INFO] Building tez 0.5.0-incubating-SNAPSHOT
[INFO] ------------------------------------------------------------------------
[INFO] 
[INFO] --- maven-clean-plugin:2.4.1:clean (default-clean) @ tez ---
[INFO] Deleting <https://builds.apache.org/job/Tez-Build/ws/target>
[INFO] 
[INFO] --- buildnumber-maven-plugin:1.1:create (default) @ tez ---
[INFO] Checking for local modifications: skipped.
[INFO] Updating project files from SCM: skipped.
[INFO] Executing: /bin/sh -c cd <https://builds.apache.org/job/Tez-Build/ws/> &&
git rev-parse --verify HEAD
[INFO] Working directory: <https://builds.apache.org/job/Tez-Build/ws/>
[INFO] Storing buildNumber: b25c8668d32fdc4839c5bae1358f4d8396160bd7 at timestamp: 1403057053524
[INFO] Executing: /bin/sh -c cd <https://builds.apache.org/job/Tez-Build/ws/> &&
git rev-parse --verify HEAD
[INFO] Working directory: <https://builds.apache.org/job/Tez-Build/ws/>
[INFO] Storing buildScmBranch: UNKNOWN
[INFO] 
[INFO] --- build-helper-maven-plugin:1.8:maven-version (maven-version) @ tez ---
[INFO] 
[INFO] --- buildnumber-maven-plugin:1.1:create (default) @ tez ---
[INFO] Checking for local modifications: skipped.
[INFO] Updating project files from SCM: skipped.
[INFO] Executing: /bin/sh -c cd <https://builds.apache.org/job/Tez-Build/ws/> &&
git rev-parse --verify HEAD
[INFO] Working directory: <https://builds.apache.org/job/Tez-Build/ws/>
[INFO] Storing buildNumber: b25c8668d32fdc4839c5bae1358f4d8396160bd7 at timestamp: 1403057053680
[INFO] Executing: /bin/sh -c cd <https://builds.apache.org/job/Tez-Build/ws/> &&
git rev-parse --verify HEAD
[INFO] Working directory: <https://builds.apache.org/job/Tez-Build/ws/>
[INFO] Storing buildScmBranch: UNKNOWN
[INFO] 
[INFO] --- build-helper-maven-plugin:1.8:maven-version (maven-version) @ tez ---
[INFO] 
[INFO] --- maven-jar-plugin:2.4:test-jar (default) @ tez ---
[WARNING] JAR will be empty - no content was marked for inclusion!
[INFO] Building jar: <https://builds.apache.org/job/Tez-Build/ws/target/tez-0.5.0-incubating-SNAPSHOT-tests.jar>
[INFO] 
[INFO] --- maven-install-plugin:2.3.1:install (default-install) @ tez ---
[INFO] Installing <https://builds.apache.org/job/Tez-Build/ws/pom.xml> to /home/jenkins/.m2/repository/org/apache/tez/tez/0.5.0-incubating-SNAPSHOT/tez-0.5.0-incubating-SNAPSHOT.pom
[INFO] Installing <https://builds.apache.org/job/Tez-Build/ws/target/tez-0.5.0-incubating-SNAPSHOT-tests.jar>
to /home/jenkins/.m2/repository/org/apache/tez/tez/0.5.0-incubating-SNAPSHOT/tez-0.5.0-incubating-SNAPSHOT-tests.jar
[INFO] 
[INFO] --- maven-deploy-plugin:2.8.1:deploy (default-deploy) @ tez ---
Downloading: https://repository.apache.org/content/repositories/snapshots/org/apache/tez/tez/0.5.0-incubating-SNAPSHOT/maven-metadata.xml

[WARNING] Could not transfer metadata org.apache.tez:tez:0.5.0-incubating-SNAPSHOT/maven-metadata.xml
from/to apache.snapshots.https (https://repository.apache.org/content/repositories/snapshots):
Error transferring file: Server returned HTTP response code: 503 for URL: https://repository.apache.org/content/repositories/snapshots/org/apache/tez/tez/0.5.0-incubating-SNAPSHOT/maven-metadata.xml
[INFO] ------------------------------------------------------------------------
[INFO] Reactor Summary:
[INFO] 
[INFO] tez ............................................... FAILURE [3.161s]
[INFO] tez-api ........................................... SKIPPED
[INFO] tez-common ........................................ SKIPPED
[INFO] tez-runtime-internals ............................. SKIPPED
[INFO] tez-runtime-library ............................... SKIPPED
[INFO] tez-mapreduce ..................................... SKIPPED
[INFO] tez-mapreduce-examples ............................ SKIPPED
[INFO] tez-dag ........................................... SKIPPED
[INFO] tez-tests ......................................... SKIPPED
[INFO] tez-plugins ....................................... SKIPPED
[INFO] tez-yarn-timeline-history ......................... SKIPPED
[INFO] tez-dist .......................................... SKIPPED
[INFO] Tez ............................................... SKIPPED
[INFO] ------------------------------------------------------------------------
[INFO] BUILD FAILURE
[INFO] ------------------------------------------------------------------------
[INFO] Total time: 3.720s
[INFO] Finished at: Wed Jun 18 02:04:14 UTC 2014
[INFO] Final Memory: 8M/111M
[INFO] ------------------------------------------------------------------------
[ERROR] Failed to execute goal org.apache.maven.plugins:maven-deploy-plugin:2.8.1:deploy (default-deploy)
on project tez: Failed to retrieve remote metadata org.apache.tez:tez:0.5.0-incubating-SNAPSHOT/maven-metadata.xml:
Could not transfer metadata org.apache.tez:tez:0.5.0-incubating-SNAPSHOT/maven-metadata.xml
from/to apache.snapshots.https (https://repository.apache.org/content/repositories/snapshots):
Error transferring file: Server returned HTTP response code: 503 for URL: https://repository.apache.org/content/repositories/snapshots/org/apache/tez/tez/0.5.0-incubating-SNAPSHOT/maven-metadata.xml
-> [Help 1]
[ERROR] 
[ERROR] To see the full stack trace of the errors, re-run Maven with the -e switch.
[ERROR] Re-run Maven using the -X switch to enable full debug logging.
[ERROR] 
[ERROR] For more information about the errors and possible solutions, please read the following
articles:
[ERROR] [Help 1] http://cwiki.apache.org/confluence/display/MAVEN/MojoExecutionException
Build step 'Execute shell' marked build as failure
Archiving artifacts
Sending artifact delta relative to Tez-Build #452
Archived 2 artifacts
Archive block size is 32768
Received 0 blocks and 30129903 bytes
Compression is 0.0%
Took 21 sec
Recording test results

Mime
View raw message