tez-dev mailing list archives

Site index · List index
Message view « Date » · « Thread »
Top « Date » · « Thread »
From Apache Jenkins Server <jenk...@builds.apache.org>
Subject Build failed in Jenkins: Tez-Build #443
Date Tue, 10 Jun 2014 02:08:22 GMT
See <https://builds.apache.org/job/Tez-Build/443/changes>

Changes:

[hitesh] TEZ-1199. EdgeVertexName in EventMetaData can be null. (hitesh)

------------------------------------------
[...truncated 1592 lines...]
4 KB   
8 KB   
12 KB   
16 KB   
20 KB   
24 KB   
28 KB   
32 KB   
36 KB   
40 KB   
44 KB   
48 KB   
52 KB   
56 KB   
60 KB   
64 KB   
68 KB   
72 KB   
76 KB   
80 KB   
84 KB   
88 KB   
92 KB   
96 KB   
100 KB   
104 KB   
108 KB   
112 KB   
116 KB   
120 KB   
124 KB   
128 KB   
132 KB   
136 KB   
140 KB   
144 KB   
148 KB   
152 KB   
156 KB   
160 KB   
164 KB   
168 KB   
172 KB   
176 KB   
180 KB   
184 KB   
188 KB   
192 KB   
196 KB   
200 KB   
204 KB   
208 KB   
212 KB   
216 KB   
219 KB   
         
Uploaded: https://repository.apache.org/content/repositories/snapshots/org/apache/tez/tez-mapreduce-examples/0.5.0-incubating-SNAPSHOT/tez-mapreduce-examples-0.5.0-incubating-20140610.015202-49.jar
(219 KB at 516.4 KB/sec)
Uploading: https://repository.apache.org/content/repositories/snapshots/org/apache/tez/tez-mapreduce-examples/0.5.0-incubating-SNAPSHOT/tez-mapreduce-examples-0.5.0-incubating-20140610.015202-49.pom
4 KB     
       
Uploaded: https://repository.apache.org/content/repositories/snapshots/org/apache/tez/tez-mapreduce-examples/0.5.0-incubating-SNAPSHOT/tez-mapreduce-examples-0.5.0-incubating-20140610.015202-49.pom
(4 KB at 22.4 KB/sec)
Downloading: https://repository.apache.org/content/repositories/snapshots/org/apache/tez/tez-mapreduce-examples/maven-metadata.xml
418 B   
        
Downloaded: https://repository.apache.org/content/repositories/snapshots/org/apache/tez/tez-mapreduce-examples/maven-metadata.xml
(418 B at 3.9 KB/sec)
Uploading: https://repository.apache.org/content/repositories/snapshots/org/apache/tez/tez-mapreduce-examples/0.5.0-incubating-SNAPSHOT/maven-metadata.xml
2 KB    
       
Uploaded: https://repository.apache.org/content/repositories/snapshots/org/apache/tez/tez-mapreduce-examples/0.5.0-incubating-SNAPSHOT/maven-metadata.xml
(2 KB at 7.1 KB/sec)
Uploading: https://repository.apache.org/content/repositories/snapshots/org/apache/tez/tez-mapreduce-examples/maven-metadata.xml
418 B   
        
Uploaded: https://repository.apache.org/content/repositories/snapshots/org/apache/tez/tez-mapreduce-examples/maven-metadata.xml
(418 B at 3.1 KB/sec)
Uploading: https://repository.apache.org/content/repositories/snapshots/org/apache/tez/tez-mapreduce-examples/0.5.0-incubating-SNAPSHOT/tez-mapreduce-examples-0.5.0-incubating-20140610.015202-49-tests.jar
4 KB    
5 KB   
       
Uploaded: https://repository.apache.org/content/repositories/snapshots/org/apache/tez/tez-mapreduce-examples/0.5.0-incubating-SNAPSHOT/tez-mapreduce-examples-0.5.0-incubating-20140610.015202-49-tests.jar
(5 KB at 36.2 KB/sec)
Uploading: https://repository.apache.org/content/repositories/snapshots/org/apache/tez/tez-mapreduce-examples/0.5.0-incubating-SNAPSHOT/maven-metadata.xml
2 KB   
       
Uploaded: https://repository.apache.org/content/repositories/snapshots/org/apache/tez/tez-mapreduce-examples/0.5.0-incubating-SNAPSHOT/maven-metadata.xml
(2 KB at 7.6 KB/sec)
[INFO] 
[INFO] --- buildnumber-maven-plugin:1.1:create (default) @ tez-mapreduce-examples ---
[INFO] Checking for local modifications: skipped.
[INFO] Updating project files from SCM: skipped.
[INFO] Executing: /bin/sh -c cd <https://builds.apache.org/job/Tez-Build/ws/tez-mapreduce-examples>
&& git rev-parse --verify HEAD
[INFO] Working directory: <https://builds.apache.org/job/Tez-Build/ws/tez-mapreduce-examples>
[INFO] Storing buildNumber: fd9d0b84972f716d7fcf569448a45bbc7aaed610 at timestamp: 1402365123345
[INFO] Executing: /bin/sh -c cd <https://builds.apache.org/job/Tez-Build/ws/tez-mapreduce-examples>
&& git rev-parse --verify HEAD
[INFO] Working directory: <https://builds.apache.org/job/Tez-Build/ws/tez-mapreduce-examples>
[INFO] Storing buildScmBranch: UNKNOWN
[INFO] 
[INFO] --- build-helper-maven-plugin:1.8:maven-version (maven-version) @ tez-mapreduce-examples
---
[INFO] 
[INFO] --- maven-resources-plugin:2.6:resources (default-resources) @ tez-mapreduce-examples
---
[INFO] Using 'UTF-8' encoding to copy filtered resources.
[INFO] skip non existing resourceDirectory <https://builds.apache.org/job/Tez-Build/ws/tez-mapreduce-examples/src/main/resources>
[INFO] 
[INFO] --- maven-compiler-plugin:3.1:compile (default-compile) @ tez-mapreduce-examples ---
[INFO] Nothing to compile - all classes are up to date
[INFO] 
[INFO] --- maven-resources-plugin:2.6:testResources (default-testResources) @ tez-mapreduce-examples
---
[INFO] Using 'UTF-8' encoding to copy filtered resources.
[INFO] skip non existing resourceDirectory <https://builds.apache.org/job/Tez-Build/ws/tez-mapreduce-examples/src/test/resources>
[INFO] 
[INFO] --- maven-compiler-plugin:3.1:testCompile (default-testCompile) @ tez-mapreduce-examples
---
[INFO] Nothing to compile - all classes are up to date
[INFO] 
[INFO] --- maven-surefire-plugin:2.14.1:test (default-test) @ tez-mapreduce-examples ---
[INFO] Skipping execution of surefire because it has already been run for this configuration
[INFO] 
[INFO] --- maven-jar-plugin:2.4:jar (default-jar) @ tez-mapreduce-examples ---
[INFO] Building jar: <https://builds.apache.org/job/Tez-Build/ws/tez-mapreduce-examples/target/tez-mapreduce-examples-0.5.0-incubating-SNAPSHOT.jar>
[INFO] 
[INFO] --- maven-jar-plugin:2.4:test-jar (default) @ tez-mapreduce-examples ---
[INFO] Building jar: <https://builds.apache.org/job/Tez-Build/ws/tez-mapreduce-examples/target/tez-mapreduce-examples-0.5.0-incubating-SNAPSHOT-tests.jar>
[INFO]                                                                         
[INFO] ------------------------------------------------------------------------
[INFO] Building tez-dag 0.5.0-incubating-SNAPSHOT
[INFO] ------------------------------------------------------------------------
[INFO] 
[INFO] --- maven-clean-plugin:2.4.1:clean (default-clean) @ tez-dag ---
[INFO] Deleting <https://builds.apache.org/job/Tez-Build/ws/tez-dag/target>
[INFO] 
[INFO] --- buildnumber-maven-plugin:1.1:create (default) @ tez-dag ---
[INFO] Checking for local modifications: skipped.
[INFO] Updating project files from SCM: skipped.
[INFO] Executing: /bin/sh -c cd <https://builds.apache.org/job/Tez-Build/ws/tez-dag>
&& git rev-parse --verify HEAD
[INFO] Working directory: <https://builds.apache.org/job/Tez-Build/ws/tez-dag>
[INFO] Storing buildNumber: fd9d0b84972f716d7fcf569448a45bbc7aaed610 at timestamp: 1402365124129
[INFO] Executing: /bin/sh -c cd <https://builds.apache.org/job/Tez-Build/ws/tez-dag>
&& git rev-parse --verify HEAD
[INFO] Working directory: <https://builds.apache.org/job/Tez-Build/ws/tez-dag>
[INFO] Storing buildScmBranch: UNKNOWN
[INFO] 
[INFO] --- build-helper-maven-plugin:1.8:maven-version (maven-version) @ tez-dag ---
[INFO] 
[INFO] --- hadoop-maven-plugins:2.4.0:protoc (compile-protoc) @ tez-dag ---
[INFO] 
[INFO] --- maven-resources-plugin:2.6:resources (default-resources) @ tez-dag ---
[INFO] Using 'UTF-8' encoding to copy filtered resources.
[INFO] Copying 1 resource
[INFO] 
[INFO] --- maven-compiler-plugin:3.1:compile (default-compile) @ tez-dag ---
[INFO] Changes detected - recompiling the module!
[INFO] Compiling 207 source files to <https://builds.apache.org/job/Tez-Build/ws/tez-dag/target/classes>
[INFO] 
[INFO] --- maven-resources-plugin:2.6:testResources (default-testResources) @ tez-dag ---
[INFO] Using 'UTF-8' encoding to copy filtered resources.
[INFO] Copying 1 resource
[INFO] 
[INFO] --- maven-compiler-plugin:3.1:testCompile (default-testCompile) @ tez-dag ---
[INFO] Changes detected - recompiling the module!
[INFO] Compiling 21 source files to <https://builds.apache.org/job/Tez-Build/ws/tez-dag/target/test-classes>
[WARNING] Note: <https://builds.apache.org/job/Tez-Build/ws/tez-dag/src/test/java/org/apache/tez/dag/app/rm/TestTezAMRMClient.java>
uses unchecked or unsafe operations.
[WARNING] Note: Recompile with -Xlint:unchecked for details.
[INFO] 
[INFO] --- maven-surefire-plugin:2.14.1:test (default-test) @ tez-dag ---
[INFO] Surefire report directory: <https://builds.apache.org/job/Tez-Build/ws/tez-dag/target/surefire-reports>

-------------------------------------------------------
 T E S T S
-------------------------------------------------------

-------------------------------------------------------
 T E S T S
-------------------------------------------------------
Running org.apache.tez.runtime.task.TestTaskExecution
Tests run: 6, Failures: 0, Errors: 0, Skipped: 0, Time elapsed: 1.733 sec
Running org.apache.tez.dag.api.client.TestVertexStatusBuilder
Tests run: 1, Failures: 0, Errors: 0, Skipped: 0, Time elapsed: 0.076 sec
Running org.apache.tez.dag.app.rm.TestContainerReuse
Tests run: 6, Failures: 0, Errors: 0, Skipped: 0, Time elapsed: 20.93 sec
Running org.apache.tez.dag.app.rm.container.TestAMContainer
Tests run: 24, Failures: 0, Errors: 0, Skipped: 0, Time elapsed: 1.058 sec
Running org.apache.tez.dag.app.rm.container.TestAMContainerMap
Tests run: 1, Failures: 0, Errors: 0, Skipped: 0, Time elapsed: 0.693 sec
Running org.apache.tez.dag.app.rm.node.TestAMNodeMap
Tests run: 3, Failures: 0, Errors: 0, Skipped: 0, Time elapsed: 2.388 sec
Running org.apache.tez.dag.app.rm.TestTezAMRMClient
Tests run: 1, Failures: 0, Errors: 0, Skipped: 0, Time elapsed: 0.756 sec
Running org.apache.tez.dag.app.rm.TestTaskScheduler
Tests run: 4, Failures: 0, Errors: 0, Skipped: 0, Time elapsed: 2.505 sec
Running org.apache.tez.dag.app.rm.TestLocalTaskScheduler
Tests run: 1, Failures: 0, Errors: 0, Skipped: 0, Time elapsed: 0.646 sec
Running org.apache.tez.dag.app.dag.impl.TestDAGImpl
Tests run: 19, Failures: 0, Errors: 0, Skipped: 2, Time elapsed: 2.927 sec
Running org.apache.tez.dag.app.dag.impl.TestVertexStats
Tests run: 1, Failures: 0, Errors: 0, Skipped: 0, Time elapsed: 0.398 sec
Running org.apache.tez.dag.app.dag.impl.TestTaskAttempt
Tests run: 10, Failures: 0, Errors: 0, Skipped: 0, Time elapsed: 1.565 sec
Running org.apache.tez.dag.app.dag.impl.TestEdge
Tests run: 1, Failures: 0, Errors: 0, Skipped: 0, Time elapsed: 0.656 sec
Running org.apache.tez.dag.app.dag.impl.TestVertexImpl
Running org.apache.tez.dag.app.dag.impl.TestTaskImpl
Tests run: 14, Failures: 0, Errors: 0, Skipped: 0, Time elapsed: 1.606 sec
Running org.apache.tez.dag.app.dag.impl.TestDAGScheduler
Tests run: 2, Failures: 0, Errors: 0, Skipped: 1, Time elapsed: 0.586 sec
Running org.apache.tez.dag.history.events.TestHistoryEventsProtoConversion
Tests run: 1, Failures: 0, Errors: 0, Skipped: 0, Time elapsed: 0.725 sec
Running org.apache.tez.dag.history.logging.impl.TestHistoryEventJsonConversion
Tests run: 1, Failures: 0, Errors: 0, Skipped: 0, Time elapsed: 0.472 sec

Results :

Tests run: 96, Failures: 0, Errors: 0, Skipped: 3

[INFO] ------------------------------------------------------------------------
[INFO] Reactor Summary:
[INFO] 
[INFO] tez ............................................... SUCCESS [8.335s]
[INFO] tez-api ........................................... SUCCESS [30.056s]
[INFO] tez-common ........................................ SUCCESS [3.802s]
[INFO] tez-runtime-internals ............................. SUCCESS [10.090s]
[INFO] tez-runtime-library ............................... SUCCESS [17.012s]
[INFO] tez-mapreduce ..................................... SUCCESS [21.133s]
[INFO] tez-mapreduce-examples ............................ SUCCESS [3.502s]
[INFO] tez-dag ........................................... FAILURE [15:48.797s]
[INFO] tez-tests ......................................... SKIPPED
[INFO] tez-plugins ....................................... SKIPPED
[INFO] tez-yarn-timeline-history ......................... SKIPPED
[INFO] tez-dist .......................................... SKIPPED
[INFO] Tez ............................................... SKIPPED
[INFO] ------------------------------------------------------------------------
[INFO] BUILD FAILURE
[INFO] ------------------------------------------------------------------------
[INFO] Total time: 17:23.393s
[INFO] Finished at: Tue Jun 10 02:07:52 UTC 2014
[INFO] Final Memory: 33M/567M
[INFO] ------------------------------------------------------------------------
[ERROR] Failed to execute goal org.apache.maven.plugins:maven-surefire-plugin:2.14.1:test
(default-test) on project tez-dag: There was a timeout or other error in the fork -> [Help
1]
[ERROR] 
[ERROR] To see the full stack trace of the errors, re-run Maven with the -e switch.
[ERROR] Re-run Maven using the -X switch to enable full debug logging.
[ERROR] 
[ERROR] For more information about the errors and possible solutions, please read the following
articles:
[ERROR] [Help 1] http://cwiki.apache.org/confluence/display/MAVEN/MojoFailureException
[ERROR] 
[ERROR] After correcting the problems, you can resume the build with the command
[ERROR]   mvn <goals> -rf :tez-dag
Build step 'Execute shell' marked build as failure
Archiving artifacts
Sending artifact delta relative to Tez-Build #442
Archived 2 artifacts
Archive block size is 32768
Received 0 blocks and 30096876 bytes
Compression is 0.0%
Took 19 sec
Recording test results

Mime
View raw message