tez-dev mailing list archives

Site index · List index
Message view « Date » · « Thread »
Top « Date » · « Thread »
From Apache Jenkins Server <jenk...@builds.apache.org>
Subject Build failed in Jenkins: Tez-Build #487
Date Wed, 09 Jul 2014 18:09:21 GMT
See <https://builds.apache.org/job/Tez-Build/487/changes>

Changes:

[bikas] TEZ-1131 addendum for missing fix. Simplify EdgeManager APIs (bikas)

------------------------------------------
[...truncated 10605 lines...]
3/3 KB   
         
Downloaded: https://maven.atlassian.com/repository/public/org/codehaus/plexus/plexus-components/1.2/plexus-components-1.2.pom
(3 KB at 9.7 KB/sec)
Downloading: https://maven.atlassian.com/repository/public/org/apache/maven/shared/maven-repository-builder/1.0-alpha-2/maven-repository-builder-1.0-alpha-2.pom
4/4 KB   
         
Downloaded: https://maven.atlassian.com/repository/public/org/apache/maven/shared/maven-repository-builder/1.0-alpha-2/maven-repository-builder-1.0-alpha-2.pom
(4 KB at 15.2 KB/sec)
Downloading: https://maven.atlassian.com/repository/public/org/apache/maven/shared/maven-common-artifact-filters/1.0-alpha-1/maven-common-artifact-filters-1.0-alpha-1.pom
2/2 KB   
         
Downloaded: https://maven.atlassian.com/repository/public/org/apache/maven/shared/maven-common-artifact-filters/1.0-alpha-1/maven-common-artifact-filters-1.0-alpha-1.pom
(2 KB at 4.2 KB/sec)
Downloading: https://maven.atlassian.com/repository/public/org/apache/maven/shared/maven-shared-components/6/maven-shared-components-6.pom
4/4 KB   
         
Downloaded: https://maven.atlassian.com/repository/public/org/apache/maven/shared/maven-shared-components/6/maven-shared-components-6.pom
(4 KB at 19.0 KB/sec)
Downloading: https://maven.atlassian.com/repository/public/org/codehaus/plexus/plexus-archiver/2.2/plexus-archiver-2.2.jar
Downloading: https://maven.atlassian.com/repository/public/org/codehaus/plexus/plexus-io/2.0.6/plexus-io-2.0.6.jar
Downloading: https://maven.atlassian.com/repository/public/org/apache/maven/shared/maven-repository-builder/1.0-alpha-2/maven-repository-builder-1.0-alpha-2.jar
4/23 KB   
8/23 KB   
4/181 KB   8/23 KB   
8/181 KB   8/23 KB   
12/181 KB   8/23 KB   
14/181 KB   8/23 KB   
14/181 KB   12/23 KB   
14/181 KB   16/23 KB   
14/181 KB   20/23 KB   
14/181 KB   23/23 KB   
18/181 KB   23/23 KB   
22/181 KB   23/23 KB   
26/181 KB   23/23 KB   
30/181 KB   23/23 KB   
34/181 KB   23/23 KB   
38/181 KB   23/23 KB   
42/181 KB   23/23 KB   
45/181 KB   23/23 KB   
                       
Downloaded: https://maven.atlassian.com/repository/public/org/apache/maven/shared/maven-repository-builder/1.0-alpha-2/maven-repository-builder-1.0-alpha-2.jar
(23 KB at 51.3 KB/sec)
4/57 KB   45/181 KB    
8/57 KB   45/181 KB   
12/57 KB   45/181 KB   
14/57 KB   45/181 KB   
14/57 KB   49/181 KB   
14/57 KB   53/181 KB   
14/57 KB   57/181 KB   
14/57 KB   61/181 KB   
14/57 KB   65/181 KB   
14/57 KB   69/181 KB   
14/57 KB   69/181 KB   
18/57 KB   69/181 KB   
22/57 KB   69/181 KB   
26/57 KB   69/181 KB   
30/57 KB   69/181 KB   
34/57 KB   69/181 KB   
38/57 KB   69/181 KB   
42/57 KB   69/181 KB   
46/57 KB   69/181 KB   
46/57 KB   73/181 KB   
46/57 KB   77/181 KB   
46/57 KB   81/181 KB   
46/57 KB   85/181 KB   
46/57 KB   89/181 KB   
46/57 KB   93/181 KB   
46/57 KB   93/181 KB   
50/57 KB   93/181 KB   
54/57 KB   93/181 KB   
57/57 KB   93/181 KB   
57/57 KB   97/181 KB   
57/57 KB   101/181 KB   
57/57 KB   105/181 KB   
57/57 KB   109/181 KB   
57/57 KB   113/181 KB   
                        
Downloaded: https://maven.atlassian.com/repository/public/org/codehaus/plexus/plexus-io/2.0.6/plexus-io-2.0.6.jar
(57 KB at 79.9 KB/sec)
117/181 KB              
121/181 KB   
125/181 KB   
129/181 KB   
132/181 KB   
136/181 KB   
140/181 KB   
144/181 KB   
148/181 KB   
152/181 KB   
156/181 KB   
160/181 KB   
164/181 KB   
168/181 KB   
172/181 KB   
176/181 KB   
180/181 KB   
181/181 KB   
             
Downloaded: https://maven.atlassian.com/repository/public/org/codehaus/plexus/plexus-archiver/2.2/plexus-archiver-2.2.jar
(181 KB at 206.0 KB/sec)
[INFO] Reading assembly descriptor: src/main/assembly/tez-dist.xml
[WARNING] NOTE: Currently, inclusion of module dependencies may produce unpredictable results
if a version conflict occurs.
Downloading: https://repository.apache.org/content/repositories/snapshots/org/apache/hadoop/hadoop-project/2.4.0/hadoop-project-2.4.0.pom
             
Downloading: http://repo.maven.apache.org/maven2/org/apache/hadoop/hadoop-project/2.4.0/hadoop-project-2.4.0.pom
             
Downloaded: http://repo.maven.apache.org/maven2/org/apache/hadoop/hadoop-project/2.4.0/hadoop-project-2.4.0.pom
(0 B at 0.0 KB/sec)
Downloading: https://repository.apache.org/content/repositories/snapshots/org/apache/hadoop/hadoop-main/2.4.0/hadoop-main-2.4.0.pom
             
Downloading: http://repo.maven.apache.org/maven2/org/apache/hadoop/hadoop-main/2.4.0/hadoop-main-2.4.0.pom
             
Downloaded: http://repo.maven.apache.org/maven2/org/apache/hadoop/hadoop-main/2.4.0/hadoop-main-2.4.0.pom
(0 B at 0.0 KB/sec)
[INFO] Building tar: <https://builds.apache.org/job/Tez-Build/487/artifact/tez-dist/target/tez-0.5.0-incubating-SNAPSHOT.tar.gz>
[INFO] 
[INFO] --- maven-assembly-plugin:2.4:single (package-tez-full) @ tez-dist ---
[INFO] Reading assembly descriptor: src/main/assembly/tez-dist-full.xml
[WARNING] NOTE: Currently, inclusion of module dependencies may produce unpredictable results
if a version conflict occurs.
[INFO] Building tar: <https://builds.apache.org/job/Tez-Build/487/artifact/tez-dist/target/tez-0.5.0-incubating-SNAPSHOT-full.tar.gz>
[INFO] 
[INFO] --- maven-jar-plugin:2.4:test-jar (default) @ tez-dist ---
[WARNING] JAR will be empty - no content was marked for inclusion!
[INFO] Building jar: <https://builds.apache.org/job/Tez-Build/ws/tez-dist/target/tez-dist-0.5.0-incubating-SNAPSHOT-tests.jar>
[INFO] 
[INFO] --- maven-install-plugin:2.4:install (default-install) @ tez-dist ---
[INFO] Installing <https://builds.apache.org/job/Tez-Build/ws/tez-dist/pom.xml> to /home/jenkins/.m2/repository/org/apache/tez/tez-dist/0.5.0-incubating-SNAPSHOT/tez-dist-0.5.0-incubating-SNAPSHOT.pom
[INFO] Installing <https://builds.apache.org/job/Tez-Build/ws/tez-dist/target/tez-dist-0.5.0-incubating-SNAPSHOT-tests.jar>
to /home/jenkins/.m2/repository/org/apache/tez/tez-dist/0.5.0-incubating-SNAPSHOT/tez-dist-0.5.0-incubating-SNAPSHOT-tests.jar
[INFO] 
[INFO] --- maven-deploy-plugin:2.8.1:deploy (default-deploy) @ tez-dist ---
[INFO] Skipping artifact deployment
[INFO] 
[INFO] --- buildnumber-maven-plugin:1.1:create (default) @ tez-dist ---
[INFO] Checking for local modifications: skipped.
[INFO] Updating project files from SCM: skipped.
[INFO] Executing: /bin/sh -c cd <https://builds.apache.org/job/Tez-Build/ws/tez-dist>
&& git rev-parse --verify HEAD
[INFO] Working directory: <https://builds.apache.org/job/Tez-Build/ws/tez-dist>
[INFO] Storing buildNumber: 392727e1791078b82c6aa666a2206a279aa8813c at timestamp: 1404929246009
[INFO] Executing: /bin/sh -c cd <https://builds.apache.org/job/Tez-Build/ws/tez-dist>
&& git rev-parse --verify HEAD
[INFO] Working directory: <https://builds.apache.org/job/Tez-Build/ws/tez-dist>
[INFO] Storing buildScmBranch: UNKNOWN
[INFO] 
[INFO] --- build-helper-maven-plugin:1.8:maven-version (maven-version) @ tez-dist ---
[INFO] 
[INFO] --- maven-assembly-plugin:2.4:single (package-tez) @ tez-dist ---
[INFO] Reading assembly descriptor: src/main/assembly/tez-dist.xml
[WARNING] NOTE: Currently, inclusion of module dependencies may produce unpredictable results
if a version conflict occurs.
[INFO] Building tar: <https://builds.apache.org/job/Tez-Build/487/artifact/tez-dist/target/tez-0.5.0-incubating-SNAPSHOT.tar.gz>
[INFO] 
[INFO] --- maven-assembly-plugin:2.4:single (package-tez-full) @ tez-dist ---
[INFO] Reading assembly descriptor: src/main/assembly/tez-dist-full.xml
[WARNING] NOTE: Currently, inclusion of module dependencies may produce unpredictable results
if a version conflict occurs.
[INFO] Building tar: <https://builds.apache.org/job/Tez-Build/487/artifact/tez-dist/target/tez-0.5.0-incubating-SNAPSHOT-full.tar.gz>
[INFO] 
[INFO] --- maven-jar-plugin:2.4:test-jar (default) @ tez-dist ---
[WARNING] JAR will be empty - no content was marked for inclusion!
[INFO]                                                                         
[INFO] ------------------------------------------------------------------------
[INFO] Building Tez 0.5.0-incubating-SNAPSHOT
[INFO] ------------------------------------------------------------------------
[INFO] 
[INFO] --- maven-clean-plugin:2.5:clean (default-clean) @ tez-docs ---
[INFO] 
[INFO] --- buildnumber-maven-plugin:1.1:create (default) @ tez-docs ---
[INFO] Checking for local modifications: skipped.
[INFO] Updating project files from SCM: skipped.
[INFO] Executing: /bin/sh -c cd <https://builds.apache.org/job/Tez-Build/ws/docs> &&
git rev-parse --verify HEAD
[INFO] Working directory: <https://builds.apache.org/job/Tez-Build/ws/docs>
[INFO] Storing buildNumber: 392727e1791078b82c6aa666a2206a279aa8813c at timestamp: 1404929255791
[INFO] Executing: /bin/sh -c cd <https://builds.apache.org/job/Tez-Build/ws/docs> &&
git rev-parse --verify HEAD
[INFO] Working directory: <https://builds.apache.org/job/Tez-Build/ws/docs>
[INFO] Storing buildScmBranch: UNKNOWN
[INFO] 
[INFO] --- build-helper-maven-plugin:1.8:maven-version (maven-version) @ tez-docs ---
[INFO] 
[INFO] --- buildnumber-maven-plugin:1.1:create (default) @ tez-docs ---
[INFO] Checking for local modifications: skipped.
[INFO] Updating project files from SCM: skipped.
[INFO] Executing: /bin/sh -c cd <https://builds.apache.org/job/Tez-Build/ws/docs> &&
git rev-parse --verify HEAD
[INFO] Working directory: <https://builds.apache.org/job/Tez-Build/ws/docs>
[INFO] Storing buildNumber: 392727e1791078b82c6aa666a2206a279aa8813c at timestamp: 1404929255803
[INFO] Executing: /bin/sh -c cd <https://builds.apache.org/job/Tez-Build/ws/docs> &&
git rev-parse --verify HEAD
[INFO] Working directory: <https://builds.apache.org/job/Tez-Build/ws/docs>
[INFO] Storing buildScmBranch: UNKNOWN
[INFO] 
[INFO] --- build-helper-maven-plugin:1.8:maven-version (maven-version) @ tez-docs ---
[INFO] 
[INFO] --- maven-jar-plugin:2.4:test-jar (default) @ tez-docs ---
[WARNING] JAR will be empty - no content was marked for inclusion!
[INFO] Building jar: <https://builds.apache.org/job/Tez-Build/ws/docs/target/tez-docs-0.5.0-incubating-SNAPSHOT-tests.jar>
[INFO] 
[INFO] --- maven-install-plugin:2.4:install (default-install) @ tez-docs ---
[INFO] Installing <https://builds.apache.org/job/Tez-Build/ws/docs/pom.xml> to /home/jenkins/.m2/repository/org/apache/tez/tez-docs/0.5.0-incubating-SNAPSHOT/tez-docs-0.5.0-incubating-SNAPSHOT.pom
[INFO] Installing <https://builds.apache.org/job/Tez-Build/ws/docs/target/tez-docs-0.5.0-incubating-SNAPSHOT-tests.jar>
to /home/jenkins/.m2/repository/org/apache/tez/tez-docs/0.5.0-incubating-SNAPSHOT/tez-docs-0.5.0-incubating-SNAPSHOT-tests.jar
[INFO] 
[INFO] --- maven-deploy-plugin:2.8.1:deploy (default-deploy) @ tez-docs ---
[INFO] Skipping artifact deployment
Downloading: https://repository.apache.org/content/repositories/snapshots/org/apache/tez/tez/0.5.0-incubating-SNAPSHOT/maven-metadata.xml
842/842 B    
            
Downloaded: https://repository.apache.org/content/repositories/snapshots/org/apache/tez/tez/0.5.0-incubating-SNAPSHOT/maven-metadata.xml
(842 B at 2.7 KB/sec)
Uploading: https://repository.apache.org/content/repositories/snapshots/org/apache/tez/tez/0.5.0-incubating-SNAPSHOT/tez-0.5.0-incubating-20140709.180736-85.pom
2/24 KB     
4/24 KB   
6/24 KB   
8/24 KB   
10/24 KB   
12/24 KB   
14/24 KB   
16/24 KB   
18/24 KB   
20/24 KB   
22/24 KB   
24/24 KB   
           
[INFO] ------------------------------------------------------------------------
[INFO] Reactor Summary:
[INFO] 
[INFO] tez ............................................... SUCCESS [ 13.445 s]
[INFO] tez-api ........................................... SUCCESS [ 42.693 s]
[INFO] tez-common ........................................ SUCCESS [  1.453 s]
[INFO] tez-runtime-internals ............................. SUCCESS [  6.741 s]
[INFO] tez-runtime-library ............................... SUCCESS [ 15.786 s]
[INFO] tez-mapreduce ..................................... SUCCESS [ 19.370 s]
[INFO] tez-mapreduce-examples ............................ SUCCESS [  1.777 s]
[INFO] tez-dag ........................................... SUCCESS [ 57.886 s]
[INFO] tez-tests ......................................... SUCCESS [15:08 min]
[INFO] tez-plugins ....................................... SUCCESS [  0.092 s]
[INFO] tez-yarn-timeline-history ......................... SUCCESS [  5.750 s]
[INFO] tez-dist .......................................... SUCCESS [ 26.317 s]
[INFO] Tez ............................................... FAILURE [  0.588 s]
[INFO] ------------------------------------------------------------------------
[INFO] BUILD FAILURE
[INFO] ------------------------------------------------------------------------
[INFO] Total time: 18:21 min
[INFO] Finished at: 2014-07-09T18:07:36+00:00
[INFO] Final Memory: 60M/1184M
[INFO] ------------------------------------------------------------------------
[ERROR] Failed to execute goal org.apache.maven.plugins:maven-deploy-plugin:2.8.1:deploy (default-deploy)
on project tez-docs: Failed to deploy artifacts: Could not transfer artifact org.apache.tez:tez:pom:0.5.0-incubating-20140709.180736-85
from/to apache.snapshots.https (https://repository.apache.org/content/repositories/snapshots):
Failed to transfer file: https://repository.apache.org/content/repositories/snapshots/org/apache/tez/tez/0.5.0-incubating-SNAPSHOT/tez-0.5.0-incubating-20140709.180736-85.pom.
Return code is: 401, ReasonPhrase: Unauthorized. -> [Help 1]
[ERROR] 
[ERROR] To see the full stack trace of the errors, re-run Maven with the -e switch.
[ERROR] Re-run Maven using the -X switch to enable full debug logging.
[ERROR] 
[ERROR] For more information about the errors and possible solutions, please read the following
articles:
[ERROR] [Help 1] http://cwiki.apache.org/confluence/display/MAVEN/MojoExecutionException
[ERROR] 
[ERROR] After correcting the problems, you can resume the build with the command
[ERROR]   mvn <goals> -rf :tez-docs
Build step 'Execute shell' marked build as failure
Archiving artifacts
Sending artifact delta relative to Tez-Build #486
Archived 2 artifacts
Archive block size is 32768
Received 0 blocks and 30252418 bytes
Compression is 0.0%
Took 18 sec
Recording test results

Mime
View raw message