tez-dev mailing list archives

Site index · List index
Message view « Date » · « Thread »
Top « Date » · « Thread »
From Apache Jenkins Server <jenk...@builds.apache.org>
Subject Build failed in Jenkins: Tez-Build #473
Date Fri, 04 Jul 2014 22:07:00 GMT
See <https://builds.apache.org/job/Tez-Build/473/>

------------------------------------------
[...truncated 819 lines...]
[INFO] 
[INFO] --- maven-compiler-plugin:3.1:testCompile (default-testCompile) @ tez-runtime-internals
---
[INFO] Nothing to compile - all classes are up to date
[INFO] 
[INFO] --- maven-surefire-plugin:2.14.1:test (default-test) @ tez-runtime-internals ---
[INFO] Skipping execution of surefire because it has already been run for this configuration
[INFO] 
[INFO] --- maven-jar-plugin:2.4:jar (default-jar) @ tez-runtime-internals ---
[INFO] Building jar: <https://builds.apache.org/job/Tez-Build/ws/tez-runtime-internals/target/tez-runtime-internals-0.5.0-incubating-SNAPSHOT.jar>
[INFO] 
[INFO] --- maven-jar-plugin:2.4:test-jar (default) @ tez-runtime-internals ---
[INFO] Building jar: <https://builds.apache.org/job/Tez-Build/ws/tez-runtime-internals/target/tez-runtime-internals-0.5.0-incubating-SNAPSHOT-tests.jar>
[INFO] 
[INFO] --- maven-install-plugin:2.3.1:install (default-install) @ tez-runtime-internals ---
[INFO] Installing <https://builds.apache.org/job/Tez-Build/ws/tez-runtime-internals/target/tez-runtime-internals-0.5.0-incubating-SNAPSHOT.jar>
to /home/jenkins/.m2/repository/org/apache/tez/tez-runtime-internals/0.5.0-incubating-SNAPSHOT/tez-runtime-internals-0.5.0-incubating-SNAPSHOT.jar
[INFO] Installing <https://builds.apache.org/job/Tez-Build/ws/tez-runtime-internals/pom.xml>
to /home/jenkins/.m2/repository/org/apache/tez/tez-runtime-internals/0.5.0-incubating-SNAPSHOT/tez-runtime-internals-0.5.0-incubating-SNAPSHOT.pom
[INFO] Installing <https://builds.apache.org/job/Tez-Build/ws/tez-runtime-internals/target/tez-runtime-internals-0.5.0-incubating-SNAPSHOT-tests.jar>
to /home/jenkins/.m2/repository/org/apache/tez/tez-runtime-internals/0.5.0-incubating-SNAPSHOT/tez-runtime-internals-0.5.0-incubating-SNAPSHOT-tests.jar
[INFO] 
[INFO] --- maven-deploy-plugin:2.8.1:deploy (default-deploy) @ tez-runtime-internals ---
Downloading: https://repository.apache.org/content/repositories/snapshots/org/apache/tez/tez-runtime-internals/0.5.0-incubating-SNAPSHOT/maven-metadata.xml
2 KB   
       
Downloaded: https://repository.apache.org/content/repositories/snapshots/org/apache/tez/tez-runtime-internals/0.5.0-incubating-SNAPSHOT/maven-metadata.xml
(2 KB at 6.6 KB/sec)
Uploading: https://repository.apache.org/content/repositories/snapshots/org/apache/tez/tez-runtime-internals/0.5.0-incubating-SNAPSHOT/tez-runtime-internals-0.5.0-incubating-20140704.220618-76.jar
4 KB   
8 KB   
12 KB   
16 KB   
20 KB   
24 KB   
28 KB   
32 KB   
36 KB   
40 KB   
44 KB   
48 KB   
52 KB   
56 KB   
60 KB   
64 KB   
68 KB   
72 KB   
76 KB   
80 KB   
84 KB   
88 KB   
92 KB   
96 KB   
100 KB   
104 KB   
108 KB   
         
Uploaded: https://repository.apache.org/content/repositories/snapshots/org/apache/tez/tez-runtime-internals/0.5.0-incubating-SNAPSHOT/tez-runtime-internals-0.5.0-incubating-20140704.220618-76.jar
(108 KB at 285.7 KB/sec)
Uploading: https://repository.apache.org/content/repositories/snapshots/org/apache/tez/tez-runtime-internals/0.5.0-incubating-SNAPSHOT/tez-runtime-internals-0.5.0-incubating-20140704.220618-76.pom
4 KB     
       
Uploaded: https://repository.apache.org/content/repositories/snapshots/org/apache/tez/tez-runtime-internals/0.5.0-incubating-SNAPSHOT/tez-runtime-internals-0.5.0-incubating-20140704.220618-76.pom
(4 KB at 25.2 KB/sec)
Downloading: https://repository.apache.org/content/repositories/snapshots/org/apache/tez/tez-runtime-internals/maven-metadata.xml
417 B   
        
Downloaded: https://repository.apache.org/content/repositories/snapshots/org/apache/tez/tez-runtime-internals/maven-metadata.xml
(417 B at 2.1 KB/sec)
Uploading: https://repository.apache.org/content/repositories/snapshots/org/apache/tez/tez-runtime-internals/0.5.0-incubating-SNAPSHOT/maven-metadata.xml
2 KB    
       
Uploaded: https://repository.apache.org/content/repositories/snapshots/org/apache/tez/tez-runtime-internals/0.5.0-incubating-SNAPSHOT/maven-metadata.xml
(2 KB at 8.0 KB/sec)
Uploading: https://repository.apache.org/content/repositories/snapshots/org/apache/tez/tez-runtime-internals/maven-metadata.xml
417 B   
        
Uploaded: https://repository.apache.org/content/repositories/snapshots/org/apache/tez/tez-runtime-internals/maven-metadata.xml
(417 B at 3.1 KB/sec)
Uploading: https://repository.apache.org/content/repositories/snapshots/org/apache/tez/tez-runtime-internals/0.5.0-incubating-SNAPSHOT/tez-runtime-internals-0.5.0-incubating-20140704.220618-76-tests.jar
4 KB    
8 KB   
12 KB   
16 KB   
20 KB   
23 KB   
        
Uploaded: https://repository.apache.org/content/repositories/snapshots/org/apache/tez/tez-runtime-internals/0.5.0-incubating-SNAPSHOT/tez-runtime-internals-0.5.0-incubating-20140704.220618-76-tests.jar
(23 KB at 157.9 KB/sec)
Uploading: https://repository.apache.org/content/repositories/snapshots/org/apache/tez/tez-runtime-internals/0.5.0-incubating-SNAPSHOT/maven-metadata.xml
2 KB    
       
Uploaded: https://repository.apache.org/content/repositories/snapshots/org/apache/tez/tez-runtime-internals/0.5.0-incubating-SNAPSHOT/maven-metadata.xml
(2 KB at 8.0 KB/sec)
[INFO] 
[INFO] --- buildnumber-maven-plugin:1.1:create (default) @ tez-runtime-internals ---
[INFO] Checking for local modifications: skipped.
[INFO] Updating project files from SCM: skipped.
[INFO] Executing: /bin/sh -c cd <https://builds.apache.org/job/Tez-Build/ws/tez-runtime-internals>
&& git rev-parse --verify HEAD
[INFO] Working directory: <https://builds.apache.org/job/Tez-Build/ws/tez-runtime-internals>
[INFO] Storing buildNumber: 6bb06d067e1342fe05acae108ded89c20cdf83de at timestamp: 1404511579867
[INFO] Executing: /bin/sh -c cd <https://builds.apache.org/job/Tez-Build/ws/tez-runtime-internals>
&& git rev-parse --verify HEAD
[INFO] Working directory: <https://builds.apache.org/job/Tez-Build/ws/tez-runtime-internals>
[INFO] Storing buildScmBranch: UNKNOWN
[INFO] 
[INFO] --- build-helper-maven-plugin:1.8:maven-version (maven-version) @ tez-runtime-internals
---
[INFO] 
[INFO] --- hadoop-maven-plugins:2.4.0:protoc (compile-protoc) @ tez-runtime-internals ---
[INFO] 
[INFO] --- maven-resources-plugin:2.6:resources (default-resources) @ tez-runtime-internals
---
[INFO] Using 'UTF-8' encoding to copy filtered resources.
[INFO] skip non existing resourceDirectory <https://builds.apache.org/job/Tez-Build/ws/tez-runtime-internals/src/main/resources>
[INFO] 
[INFO] --- maven-compiler-plugin:3.1:compile (default-compile) @ tez-runtime-internals ---
[INFO] Changes detected - recompiling the module!
[INFO] Compiling 36 source files to <https://builds.apache.org/job/Tez-Build/ws/tez-runtime-internals/target/classes>
[INFO] 
[INFO] --- maven-resources-plugin:2.6:testResources (default-testResources) @ tez-runtime-internals
---
[INFO] Using 'UTF-8' encoding to copy filtered resources.
[INFO] skip non existing resourceDirectory <https://builds.apache.org/job/Tez-Build/ws/tez-runtime-internals/src/test/resources>
[INFO] 
[INFO] --- maven-compiler-plugin:3.1:testCompile (default-testCompile) @ tez-runtime-internals
---
[INFO] Nothing to compile - all classes are up to date
[INFO] 
[INFO] --- maven-surefire-plugin:2.14.1:test (default-test) @ tez-runtime-internals ---
[INFO] Skipping execution of surefire because it has already been run for this configuration
[INFO] 
[INFO] --- maven-jar-plugin:2.4:jar (default-jar) @ tez-runtime-internals ---
[INFO] Building jar: <https://builds.apache.org/job/Tez-Build/ws/tez-runtime-internals/target/tez-runtime-internals-0.5.0-incubating-SNAPSHOT.jar>
[INFO] 
[INFO] --- maven-jar-plugin:2.4:test-jar (default) @ tez-runtime-internals ---
[INFO] Building jar: <https://builds.apache.org/job/Tez-Build/ws/tez-runtime-internals/target/tez-runtime-internals-0.5.0-incubating-SNAPSHOT-tests.jar>
[INFO]                                                                         
[INFO] ------------------------------------------------------------------------
[INFO] Building tez-runtime-library 0.5.0-incubating-SNAPSHOT
[INFO] ------------------------------------------------------------------------
[INFO] 
[INFO] --- maven-clean-plugin:2.4.1:clean (default-clean) @ tez-runtime-library ---
[INFO] Deleting <https://builds.apache.org/job/Tez-Build/ws/tez-runtime-library/target>
[INFO] 
[INFO] --- buildnumber-maven-plugin:1.1:create (default) @ tez-runtime-library ---
[INFO] Checking for local modifications: skipped.
[INFO] Updating project files from SCM: skipped.
[INFO] Executing: /bin/sh -c cd <https://builds.apache.org/job/Tez-Build/ws/tez-runtime-library>
&& git rev-parse --verify HEAD
[INFO] Working directory: <https://builds.apache.org/job/Tez-Build/ws/tez-runtime-library>
[INFO] Storing buildNumber: 6bb06d067e1342fe05acae108ded89c20cdf83de at timestamp: 1404511580666
[INFO] Executing: /bin/sh -c cd <https://builds.apache.org/job/Tez-Build/ws/tez-runtime-library>
&& git rev-parse --verify HEAD
[INFO] Working directory: <https://builds.apache.org/job/Tez-Build/ws/tez-runtime-library>
[INFO] Storing buildScmBranch: UNKNOWN
[INFO] 
[INFO] --- build-helper-maven-plugin:1.8:maven-version (maven-version) @ tez-runtime-library
---
[INFO] 
[INFO] --- hadoop-maven-plugins:2.4.0:protoc (compile-protoc) @ tez-runtime-library ---
[INFO] 
[INFO] --- maven-resources-plugin:2.6:resources (default-resources) @ tez-runtime-library
---
[INFO] Using 'UTF-8' encoding to copy filtered resources.
[INFO] skip non existing resourceDirectory <https://builds.apache.org/job/Tez-Build/ws/tez-runtime-library/src/main/resources>
[INFO] 
[INFO] --- maven-compiler-plugin:3.1:compile (default-compile) @ tez-runtime-library ---
[INFO] Changes detected - recompiling the module!
[INFO] Compiling 84 source files to <https://builds.apache.org/job/Tez-Build/ws/tez-runtime-library/target/classes>
[INFO] 
[INFO] --- maven-resources-plugin:2.6:testResources (default-testResources) @ tez-runtime-library
---
[INFO] Using 'UTF-8' encoding to copy filtered resources.
[INFO] Copying 1 resource
[INFO] 
[INFO] --- maven-compiler-plugin:3.1:testCompile (default-testCompile) @ tez-runtime-library
---
[INFO] Changes detected - recompiling the module!
[INFO] Compiling 11 source files to <https://builds.apache.org/job/Tez-Build/ws/tez-runtime-library/target/test-classes>
[INFO] 
[INFO] --- maven-surefire-plugin:2.14.1:test (default-test) @ tez-runtime-library ---
[INFO] Surefire report directory: <https://builds.apache.org/job/Tez-Build/ws/tez-runtime-library/target/surefire-reports>

-------------------------------------------------------
 T E S T S
-------------------------------------------------------

-------------------------------------------------------
 T E S T S
-------------------------------------------------------
Running org.apache.tez.runtime.common.resources.TestWeightedScalingMemoryDistributor
Tests run: 7, Failures: 0, Errors: 0, Skipped: 0, Time elapsed: 1.018 sec
Running org.apache.tez.runtime.library.input.TestSortedGroupedMergedInput
Tests run: 7, Failures: 0, Errors: 0, Skipped: 0, Time elapsed: 0.213 sec
Running org.apache.tez.runtime.library.common.sort.impl.TestIFile
Tests run: 4, Failures: 0, Errors: 0, Skipped: 2, Time elapsed: 0.72 sec
Running org.apache.tez.runtime.library.common.TestInputIdentifiers
Tests run: 1, Failures: 0, Errors: 0, Skipped: 0, Time elapsed: 0.076 sec
Running org.apache.tez.runtime.library.common.writers.TestUnorderedPartitionedKVWriter
Tests run: 22, Failures: 1, Errors: 0, Skipped: 0, Time elapsed: 2.46 sec <<< FAILURE!
testSkippedPartitions[0](org.apache.tez.runtime.library.common.writers.TestUnorderedPartitionedKVWriter)
 Time elapsed: 0.088 sec  <<< FAILURE!
java.lang.AssertionError: null
	at org.junit.Assert.fail(Assert.java:86)
	at org.junit.Assert.assertTrue(Assert.java:41)
	at org.junit.Assert.assertTrue(Assert.java:52)
	at org.apache.tez.runtime.library.common.writers.TestUnorderedPartitionedKVWriter.baseTest(TestUnorderedPartitionedKVWriter.java:445)
	at org.apache.tez.runtime.library.common.writers.TestUnorderedPartitionedKVWriter.testSkippedPartitions(TestUnorderedPartitionedKVWriter.java:188)

Running org.apache.tez.runtime.library.shuffle.common.impl.TestSimpleFetchedInputAllocator
Tests run: 1, Failures: 0, Errors: 0, Skipped: 0, Time elapsed: 0.774 sec
Running org.apache.tez.runtime.library.shuffle.common.impl.TestShuffleInputEventHandlerImpl
Tests run: 4, Failures: 0, Errors: 0, Skipped: 0, Time elapsed: 0.478 sec
Running org.apache.tez.runtime.library.output.TestOnFileUnorderedKVOutput
Tests run: 1, Failures: 0, Errors: 0, Skipped: 0, Time elapsed: 1.195 sec
Running org.apache.tez.dag.library.vertexmanager.TestInputReadyVertexManager
Tests run: 3, Failures: 0, Errors: 0, Skipped: 0, Time elapsed: 0.542 sec
Running org.apache.tez.dag.library.vertexmanager.TestShuffleVertexManager
Tests run: 2, Failures: 0, Errors: 0, Skipped: 0, Time elapsed: 0.816 sec

Results :

Failed tests: 
  TestUnorderedPartitionedKVWriter.testSkippedPartitions:188->baseTest:445 null

Tests run: 52, Failures: 1, Errors: 0, Skipped: 2

[INFO] ------------------------------------------------------------------------
[INFO] Reactor Summary:
[INFO] 
[INFO] tez ............................................... SUCCESS [4.139s]
[INFO] tez-api ........................................... SUCCESS [37.967s]
[INFO] tez-common ........................................ SUCCESS [3.120s]
[INFO] tez-runtime-internals ............................. SUCCESS [9.741s]
[INFO] tez-runtime-library ............................... FAILURE [12.299s]
[INFO] tez-mapreduce ..................................... SKIPPED
[INFO] tez-mapreduce-examples ............................ SKIPPED
[INFO] tez-dag ........................................... SKIPPED
[INFO] tez-tests ......................................... SKIPPED
[INFO] tez-plugins ....................................... SKIPPED
[INFO] tez-yarn-timeline-history ......................... SKIPPED
[INFO] tez-dist .......................................... SKIPPED
[INFO] Tez ............................................... SKIPPED
[INFO] ------------------------------------------------------------------------
[INFO] BUILD FAILURE
[INFO] ------------------------------------------------------------------------
[INFO] Total time: 1:07.865s
[INFO] Finished at: Fri Jul 04 22:06:32 UTC 2014
[INFO] Final Memory: 28M/670M
[INFO] ------------------------------------------------------------------------
[ERROR] Failed to execute goal org.apache.maven.plugins:maven-surefire-plugin:2.14.1:test
(default-test) on project tez-runtime-library: There are test failures.
[ERROR] 
[ERROR] Please refer to <https://builds.apache.org/job/Tez-Build/ws/tez-runtime-library/target/surefire-reports>
for the individual test results.
[ERROR] -> [Help 1]
[ERROR] 
[ERROR] To see the full stack trace of the errors, re-run Maven with the -e switch.
[ERROR] Re-run Maven using the -X switch to enable full debug logging.
[ERROR] 
[ERROR] For more information about the errors and possible solutions, please read the following
articles:
[ERROR] [Help 1] http://cwiki.apache.org/confluence/display/MAVEN/MojoFailureException
[ERROR] 
[ERROR] After correcting the problems, you can resume the build with the command
[ERROR]   mvn <goals> -rf :tez-runtime-library
Build step 'Execute shell' marked build as failure
Archiving artifacts
Sending artifact delta relative to Tez-Build #466
Archived 2 artifacts
Archive block size is 32768
Received 0 blocks and 30164363 bytes
Compression is 0.0%
Took 22 sec
Recording test results

Mime
View raw message