tez-dev mailing list archives

Site index · List index
Message view « Date » · « Thread »
Top « Date » · « Thread »
From Apache Jenkins Server <jenk...@builds.apache.org>
Subject Build failed in Jenkins: Tez-Build #475
Date Fri, 04 Jul 2014 22:13:14 GMT
See <https://builds.apache.org/job/Tez-Build/475/>

------------------------------------------
[...truncated 1628 lines...]
72 KB   
76 KB   
80 KB   
84 KB   
88 KB   
92 KB   
96 KB   
100 KB   
104 KB   
108 KB   
112 KB   
116 KB   
120 KB   
124 KB   
128 KB   
132 KB   
136 KB   
140 KB   
144 KB   
148 KB   
152 KB   
156 KB   
160 KB   
164 KB   
168 KB   
172 KB   
176 KB   
180 KB   
184 KB   
188 KB   
192 KB   
196 KB   
200 KB   
204 KB   
208 KB   
212 KB   
215 KB   
         
Uploaded: https://repository.apache.org/content/repositories/snapshots/org/apache/tez/tez-mapreduce-examples/0.5.0-incubating-SNAPSHOT/tez-mapreduce-examples-0.5.0-incubating-20140704.221135-72.jar
(215 KB at 406.0 KB/sec)
Uploading: https://repository.apache.org/content/repositories/snapshots/org/apache/tez/tez-mapreduce-examples/0.5.0-incubating-SNAPSHOT/tez-mapreduce-examples-0.5.0-incubating-20140704.221135-72.pom
4 KB     
       
Uploaded: https://repository.apache.org/content/repositories/snapshots/org/apache/tez/tez-mapreduce-examples/0.5.0-incubating-SNAPSHOT/tez-mapreduce-examples-0.5.0-incubating-20140704.221135-72.pom
(4 KB at 23.3 KB/sec)
Downloading: https://repository.apache.org/content/repositories/snapshots/org/apache/tez/tez-mapreduce-examples/maven-metadata.xml
418 B   
        
Downloaded: https://repository.apache.org/content/repositories/snapshots/org/apache/tez/tez-mapreduce-examples/maven-metadata.xml
(418 B at 5.0 KB/sec)
Uploading: https://repository.apache.org/content/repositories/snapshots/org/apache/tez/tez-mapreduce-examples/0.5.0-incubating-SNAPSHOT/maven-metadata.xml
2 KB    
       
Uploaded: https://repository.apache.org/content/repositories/snapshots/org/apache/tez/tez-mapreduce-examples/0.5.0-incubating-SNAPSHOT/maven-metadata.xml
(2 KB at 7.9 KB/sec)
Uploading: https://repository.apache.org/content/repositories/snapshots/org/apache/tez/tez-mapreduce-examples/maven-metadata.xml
418 B   
        
Uploaded: https://repository.apache.org/content/repositories/snapshots/org/apache/tez/tez-mapreduce-examples/maven-metadata.xml
(418 B at 3.1 KB/sec)
Uploading: https://repository.apache.org/content/repositories/snapshots/org/apache/tez/tez-mapreduce-examples/0.5.0-incubating-SNAPSHOT/tez-mapreduce-examples-0.5.0-incubating-20140704.221135-72-tests.jar
4 KB    
5 KB   
       
Uploaded: https://repository.apache.org/content/repositories/snapshots/org/apache/tez/tez-mapreduce-examples/0.5.0-incubating-SNAPSHOT/tez-mapreduce-examples-0.5.0-incubating-20140704.221135-72-tests.jar
(5 KB at 36.5 KB/sec)
Uploading: https://repository.apache.org/content/repositories/snapshots/org/apache/tez/tez-mapreduce-examples/0.5.0-incubating-SNAPSHOT/maven-metadata.xml
2 KB   
       
Uploaded: https://repository.apache.org/content/repositories/snapshots/org/apache/tez/tez-mapreduce-examples/0.5.0-incubating-SNAPSHOT/maven-metadata.xml
(2 KB at 7.0 KB/sec)
[INFO] 
[INFO] --- buildnumber-maven-plugin:1.1:create (default) @ tez-mapreduce-examples ---
[INFO] Checking for local modifications: skipped.
[INFO] Updating project files from SCM: skipped.
[INFO] Executing: /bin/sh -c cd <https://builds.apache.org/job/Tez-Build/ws/tez-mapreduce-examples>
&& git rev-parse --verify HEAD
[INFO] Working directory: <https://builds.apache.org/job/Tez-Build/ws/tez-mapreduce-examples>
[INFO] Storing buildNumber: 6bb06d067e1342fe05acae108ded89c20cdf83de at timestamp: 1404511897157
[INFO] Executing: /bin/sh -c cd <https://builds.apache.org/job/Tez-Build/ws/tez-mapreduce-examples>
&& git rev-parse --verify HEAD
[INFO] Working directory: <https://builds.apache.org/job/Tez-Build/ws/tez-mapreduce-examples>
[INFO] Storing buildScmBranch: UNKNOWN
[INFO] 
[INFO] --- build-helper-maven-plugin:1.8:maven-version (maven-version) @ tez-mapreduce-examples
---
[INFO] 
[INFO] --- maven-resources-plugin:2.6:resources (default-resources) @ tez-mapreduce-examples
---
[INFO] Using 'UTF-8' encoding to copy filtered resources.
[INFO] skip non existing resourceDirectory <https://builds.apache.org/job/Tez-Build/ws/tez-mapreduce-examples/src/main/resources>
[INFO] 
[INFO] --- maven-compiler-plugin:3.1:compile (default-compile) @ tez-mapreduce-examples ---
[INFO] Nothing to compile - all classes are up to date
[INFO] 
[INFO] --- maven-resources-plugin:2.6:testResources (default-testResources) @ tez-mapreduce-examples
---
[INFO] Using 'UTF-8' encoding to copy filtered resources.
[INFO] skip non existing resourceDirectory <https://builds.apache.org/job/Tez-Build/ws/tez-mapreduce-examples/src/test/resources>
[INFO] 
[INFO] --- maven-compiler-plugin:3.1:testCompile (default-testCompile) @ tez-mapreduce-examples
---
[INFO] Nothing to compile - all classes are up to date
[INFO] 
[INFO] --- maven-surefire-plugin:2.14.1:test (default-test) @ tez-mapreduce-examples ---
[INFO] Skipping execution of surefire because it has already been run for this configuration
[INFO] 
[INFO] --- maven-jar-plugin:2.4:jar (default-jar) @ tez-mapreduce-examples ---
[INFO] Building jar: <https://builds.apache.org/job/Tez-Build/ws/tez-mapreduce-examples/target/tez-mapreduce-examples-0.5.0-incubating-SNAPSHOT.jar>
[INFO] 
[INFO] --- maven-jar-plugin:2.4:test-jar (default) @ tez-mapreduce-examples ---
[INFO] Building jar: <https://builds.apache.org/job/Tez-Build/ws/tez-mapreduce-examples/target/tez-mapreduce-examples-0.5.0-incubating-SNAPSHOT-tests.jar>
[INFO]                                                                         
[INFO] ------------------------------------------------------------------------
[INFO] Building tez-dag 0.5.0-incubating-SNAPSHOT
[INFO] ------------------------------------------------------------------------
[INFO] 
[INFO] --- maven-clean-plugin:2.4.1:clean (default-clean) @ tez-dag ---
[INFO] Deleting <https://builds.apache.org/job/Tez-Build/ws/tez-dag/target>
[INFO] 
[INFO] --- buildnumber-maven-plugin:1.1:create (default) @ tez-dag ---
[INFO] Checking for local modifications: skipped.
[INFO] Updating project files from SCM: skipped.
[INFO] Executing: /bin/sh -c cd <https://builds.apache.org/job/Tez-Build/ws/tez-dag>
&& git rev-parse --verify HEAD
[INFO] Working directory: <https://builds.apache.org/job/Tez-Build/ws/tez-dag>
[INFO] Storing buildNumber: 6bb06d067e1342fe05acae108ded89c20cdf83de at timestamp: 1404511897567
[INFO] Executing: /bin/sh -c cd <https://builds.apache.org/job/Tez-Build/ws/tez-dag>
&& git rev-parse --verify HEAD
[INFO] Working directory: <https://builds.apache.org/job/Tez-Build/ws/tez-dag>
[INFO] Storing buildScmBranch: UNKNOWN
[INFO] 
[INFO] --- build-helper-maven-plugin:1.8:maven-version (maven-version) @ tez-dag ---
[INFO] 
[INFO] --- hadoop-maven-plugins:2.4.0:protoc (compile-protoc) @ tez-dag ---
[INFO] 
[INFO] --- maven-resources-plugin:2.6:resources (default-resources) @ tez-dag ---
[INFO] Using 'UTF-8' encoding to copy filtered resources.
[INFO] Copying 1 resource
[INFO] 
[INFO] --- maven-compiler-plugin:3.1:compile (default-compile) @ tez-dag ---
[INFO] Changes detected - recompiling the module!
[INFO] Compiling 208 source files to <https://builds.apache.org/job/Tez-Build/ws/tez-dag/target/classes>
[INFO] 
[INFO] --- maven-resources-plugin:2.6:testResources (default-testResources) @ tez-dag ---
[INFO] Using 'UTF-8' encoding to copy filtered resources.
[INFO] Copying 1 resource
[INFO] 
[INFO] --- maven-compiler-plugin:3.1:testCompile (default-testCompile) @ tez-dag ---
[INFO] Changes detected - recompiling the module!
[INFO] Compiling 24 source files to <https://builds.apache.org/job/Tez-Build/ws/tez-dag/target/test-classes>
[WARNING] Note: <https://builds.apache.org/job/Tez-Build/ws/tez-dag/src/test/java/org/apache/tez/dag/app/rm/TestTezAMRMClient.java>
uses unchecked or unsafe operations.
[WARNING] Note: Recompile with -Xlint:unchecked for details.
[INFO] 
[INFO] --- maven-surefire-plugin:2.14.1:test (default-test) @ tez-dag ---
[INFO] Surefire report directory: <https://builds.apache.org/job/Tez-Build/ws/tez-dag/target/surefire-reports>

-------------------------------------------------------
 T E S T S
-------------------------------------------------------

-------------------------------------------------------
 T E S T S
-------------------------------------------------------
Running org.apache.tez.runtime.task.TestTaskExecution
Tests run: 6, Failures: 0, Errors: 0, Skipped: 0, Time elapsed: 1.702 sec
Running org.apache.tez.dag.api.client.TestDAGClientHandler
Tests run: 1, Failures: 0, Errors: 0, Skipped: 0, Time elapsed: 0.816 sec
Running org.apache.tez.dag.api.client.TestVertexStatusBuilder
Tests run: 1, Failures: 0, Errors: 0, Skipped: 0, Time elapsed: 0.095 sec
Running org.apache.tez.dag.utils.TestJavaProfilerOptions
Tests run: 2, Failures: 0, Errors: 0, Skipped: 0, Time elapsed: 0.388 sec
Running org.apache.tez.dag.app.rm.TestContainerReuse
Tests run: 7, Failures: 0, Errors: 1, Skipped: 0, Time elapsed: 31.359 sec <<< FAILURE!
testReuseWithProfilerOption(org.apache.tez.dag.app.rm.TestContainerReuse)  Time elapsed: 10.01
sec  <<< ERROR!
java.lang.Exception: test timed out after 10000 milliseconds
	at java.lang.Object.wait(Native Method)
	at java.lang.Object.wait(Object.java:485)
	at org.apache.tez.dag.app.rm.TestTaskSchedulerHelpers.waitForDelayedDrainNotify(TestTaskSchedulerHelpers.java:376)
	at org.apache.tez.dag.app.rm.TestContainerReuse.testReuseWithProfilerOption(TestContainerReuse.java:575)

Running org.apache.tez.dag.app.rm.container.TestAMContainer
Tests run: 23, Failures: 0, Errors: 0, Skipped: 0, Time elapsed: 1.152 sec
Running org.apache.tez.dag.app.rm.node.TestAMNodeMap
Tests run: 3, Failures: 0, Errors: 0, Skipped: 0, Time elapsed: 2.347 sec
Running org.apache.tez.dag.app.rm.TestTezAMRMClient
Tests run: 1, Failures: 0, Errors: 0, Skipped: 0, Time elapsed: 0.836 sec
Running org.apache.tez.dag.app.rm.TestTaskScheduler
Tests run: 4, Failures: 0, Errors: 0, Skipped: 0, Time elapsed: 2.717 sec
Running org.apache.tez.dag.app.rm.TestLocalTaskScheduler
Tests run: 1, Failures: 0, Errors: 0, Skipped: 0, Time elapsed: 0.695 sec
Running org.apache.tez.dag.app.dag.impl.TestDAGImpl
Tests run: 19, Failures: 0, Errors: 0, Skipped: 2, Time elapsed: 3.183 sec
Running org.apache.tez.dag.app.dag.impl.TestVertexStats
Tests run: 1, Failures: 0, Errors: 0, Skipped: 0, Time elapsed: 0.455 sec
Running org.apache.tez.dag.app.dag.impl.TestRootInputVertexManager
Tests run: 2, Failures: 0, Errors: 0, Skipped: 0, Time elapsed: 0.319 sec
Running org.apache.tez.dag.app.dag.impl.TestTaskAttempt
Tests run: 10, Failures: 0, Errors: 0, Skipped: 0, Time elapsed: 1.774 sec
Running org.apache.tez.dag.app.dag.impl.TestEdge
Tests run: 1, Failures: 0, Errors: 0, Skipped: 0, Time elapsed: 0.69 sec
Running org.apache.tez.dag.app.dag.impl.TestVertexImpl
Tests run: 47, Failures: 0, Errors: 0, Skipped: 1, Time elapsed: 5.113 sec
Running org.apache.tez.dag.app.dag.impl.TestTaskImpl
Tests run: 17, Failures: 0, Errors: 0, Skipped: 0, Time elapsed: 1.799 sec
Running org.apache.tez.dag.app.dag.impl.TestDAGScheduler
Tests run: 2, Failures: 0, Errors: 0, Skipped: 1, Time elapsed: 0.611 sec
Running org.apache.tez.dag.history.events.TestHistoryEventsProtoConversion
Tests run: 1, Failures: 0, Errors: 0, Skipped: 0, Time elapsed: 0.725 sec
Running org.apache.tez.dag.history.logging.impl.TestHistoryEventJsonConversion
Tests run: 1, Failures: 0, Errors: 0, Skipped: 0, Time elapsed: 0.498 sec

Results :

Tests in error: 
  TestContainerReuse.testReuseWithProfilerOption:575->Object.wait:485->Object.wait:-2
ยป 

Tests run: 150, Failures: 0, Errors: 1, Skipped: 4

[INFO] ------------------------------------------------------------------------
[INFO] Reactor Summary:
[INFO] 
[INFO] tez ............................................... SUCCESS [4.066s]
[INFO] tez-api ........................................... SUCCESS [36.915s]
[INFO] tez-common ........................................ SUCCESS [3.242s]
[INFO] tez-runtime-internals ............................. SUCCESS [9.618s]
[INFO] tez-runtime-library ............................... SUCCESS [21.523s]
[INFO] tez-mapreduce ..................................... SUCCESS [23.375s]
[INFO] tez-mapreduce-examples ............................ SUCCESS [2.871s]
[INFO] tez-dag ........................................... FAILURE [1:07.077s]
[INFO] tez-tests ......................................... SKIPPED
[INFO] tez-plugins ....................................... SKIPPED
[INFO] tez-yarn-timeline-history ......................... SKIPPED
[INFO] tez-dist .......................................... SKIPPED
[INFO] Tez ............................................... SKIPPED
[INFO] ------------------------------------------------------------------------
[INFO] BUILD FAILURE
[INFO] ------------------------------------------------------------------------
[INFO] Total time: 2:49.284s
[INFO] Finished at: Fri Jul 04 22:12:44 UTC 2014
[INFO] Final Memory: 27M/771M
[INFO] ------------------------------------------------------------------------
[ERROR] Failed to execute goal org.apache.maven.plugins:maven-surefire-plugin:2.14.1:test
(default-test) on project tez-dag: There are test failures.
[ERROR] 
[ERROR] Please refer to <https://builds.apache.org/job/Tez-Build/ws/tez-dag/target/surefire-reports>
for the individual test results.
[ERROR] -> [Help 1]
[ERROR] 
[ERROR] To see the full stack trace of the errors, re-run Maven with the -e switch.
[ERROR] Re-run Maven using the -X switch to enable full debug logging.
[ERROR] 
[ERROR] For more information about the errors and possible solutions, please read the following
articles:
[ERROR] [Help 1] http://cwiki.apache.org/confluence/display/MAVEN/MojoFailureException
[ERROR] 
[ERROR] After correcting the problems, you can resume the build with the command
[ERROR]   mvn <goals> -rf :tez-dag
Build step 'Execute shell' marked build as failure
Archiving artifacts
Sending artifact delta relative to Tez-Build #466
Archived 2 artifacts
Archive block size is 32768
Received 0 blocks and 30164363 bytes
Compression is 0.0%
Took 20 sec
Recording test results

Mime
View raw message