tez-dev mailing list archives

Site index · List index
Message view « Date » · « Thread »
Top « Date » · « Thread »
From Apache Jenkins Server <jenk...@builds.apache.org>
Subject Build failed in Jenkins: Tez-Build #779
Date Fri, 12 Dec 2014 18:54:57 GMT
See <https://builds.apache.org/job/Tez-Build/779/changes>

Changes:

[sseth] TEZ-1775. Allow specifying log level per logger. (sseth)

[sseth] Update CHANGES.txt for TEZ-1775

------------------------------------------
[...truncated 1993 lines...]
Running "concat:dist/scripts/components.js" (concat) task
File "dist/scripts/components.js" created.

Running "concat:dist/scripts/templates.js" (concat) task
File "dist/scripts/templates.js" created.

Running "concat:dist/scripts/main.js" (concat) task
File "dist/scripts/main.js" created.

Running "cssmin:dist" (cssmin) task
File dist/styles/main.css created.

Running "cssmin:dist/styles/main.css" (cssmin) task
File dist/styles/main.css created.

Running "copy:dist" (copy) task
Copied 24 files

Running "usemin:html" (usemin) task

Processing as HTML - dist/index.html
Update the HTML to reference our concat/min/revved script files
Update the HTML with the new css filenames
Update the HTML with the new img filenames
Update the HTML with data-main tags
Update the HTML with the data tags
Update the HTML with background imgs, case there is some inline style
Update the HTML with anchors images
Update the HTML with reference in input

Running "usemin:css" (usemin) task

Processing as CSS - dist/styles/main.css
Update the CSS with new img filenames

Done, without errors.
[INFO] 
[INFO] --- maven-resources-plugin:2.6:resources (default-resources) @ tez-ui ---
[INFO] Using 'UTF-8' encoding to copy filtered resources.
[INFO] Copying 1 resource
[INFO] 
[INFO] --- maven-compiler-plugin:3.1:compile (default-compile) @ tez-ui ---
[INFO] No sources to compile
[INFO] 
[INFO] --- maven-resources-plugin:2.6:testResources (default-testResources) @ tez-ui ---
[INFO] Using 'UTF-8' encoding to copy filtered resources.
[INFO] skip non existing resourceDirectory <https://builds.apache.org/job/Tez-Build/ws/tez-ui/src/test/resources>
[INFO] 
[INFO] --- maven-compiler-plugin:3.1:testCompile (default-testCompile) @ tez-ui ---
[INFO] No sources to compile
[INFO] 
[INFO] --- maven-surefire-plugin:2.14.1:test (default-test) @ tez-ui ---
[INFO] No tests to run.
[INFO] Skipping execution of surefire because it has already been run for this configuration
[INFO] 
[INFO] --- maven-war-plugin:2.5:war (default-war) @ tez-ui ---
[INFO] Packaging webapp
[INFO] Assembling webapp [tez-ui] in [<https://builds.apache.org/job/Tez-Build/ws/tez-ui/target/tez-ui-0.6.0-SNAPSHOT]>
[INFO] Processing war project
[INFO] Copying webapp resources [<https://builds.apache.org/job/Tez-Build/ws/tez-ui/src/main/webapp/dist]>
[INFO] Webapp assembled in [18 msecs]
[INFO] Building war: <https://builds.apache.org/job/Tez-Build/ws/tez-ui/target/tez-ui-0.6.0-SNAPSHOT.war>
[INFO] 
[INFO] --- maven-assembly-plugin:2.4:single (default) @ tez-ui ---
[INFO] Building tar: <https://builds.apache.org/job/Tez-Build/ws/tez-ui/target/tez-ui-0.6.0-SNAPSHOT-web.tar.gz>
[INFO] 
[INFO] --- maven-jar-plugin:2.4:test-jar (default) @ tez-ui ---
[WARNING] JAR will be empty - no content was marked for inclusion!
[INFO] Building jar: <https://builds.apache.org/job/Tez-Build/ws/tez-ui/target/tez-ui-0.6.0-SNAPSHOT-tests.jar>
[INFO]                                                                         
[INFO] ------------------------------------------------------------------------
[INFO] Building tez-plugins 0.6.0-SNAPSHOT
[INFO] ------------------------------------------------------------------------
[INFO] 
[INFO] --- maven-clean-plugin:2.5:clean (default-clean) @ tez-plugins ---
[INFO] Deleting <https://builds.apache.org/job/Tez-Build/ws/tez-plugins/target>
[INFO] 
[INFO] --- buildnumber-maven-plugin:1.1:create (default) @ tez-plugins ---
[INFO] Checking for local modifications: skipped.
[INFO] Updating project files from SCM: skipped.
[INFO] Executing: /bin/sh -c cd <https://builds.apache.org/job/Tez-Build/ws/tez-plugins>
&& git rev-parse --verify HEAD
[INFO] Working directory: <https://builds.apache.org/job/Tez-Build/ws/tez-plugins>
[INFO] Storing buildNumber: 976eda9759a378283158c92171a8cda6b0a150d2 at timestamp: 1418410480104
[INFO] Executing: /bin/sh -c cd <https://builds.apache.org/job/Tez-Build/ws/tez-plugins>
&& git rev-parse --verify HEAD
[INFO] Working directory: <https://builds.apache.org/job/Tez-Build/ws/tez-plugins>
[INFO] Storing buildScmBranch: UNKNOWN
[INFO] 
[INFO] --- build-helper-maven-plugin:1.8:maven-version (maven-version) @ tez-plugins ---
[INFO] 
[INFO] --- buildnumber-maven-plugin:1.1:create (default) @ tez-plugins ---
[INFO] Checking for local modifications: skipped.
[INFO] Updating project files from SCM: skipped.
[INFO] Executing: /bin/sh -c cd <https://builds.apache.org/job/Tez-Build/ws/tez-plugins>
&& git rev-parse --verify HEAD
[INFO] Working directory: <https://builds.apache.org/job/Tez-Build/ws/tez-plugins>
[INFO] Storing buildNumber: 976eda9759a378283158c92171a8cda6b0a150d2 at timestamp: 1418410480116
[INFO] Executing: /bin/sh -c cd <https://builds.apache.org/job/Tez-Build/ws/tez-plugins>
&& git rev-parse --verify HEAD
[INFO] Working directory: <https://builds.apache.org/job/Tez-Build/ws/tez-plugins>
[INFO] Storing buildScmBranch: UNKNOWN
[INFO] 
[INFO] --- build-helper-maven-plugin:1.8:maven-version (maven-version) @ tez-plugins ---
[INFO] 
[INFO] --- maven-jar-plugin:2.4:test-jar (default) @ tez-plugins ---
[WARNING] JAR will be empty - no content was marked for inclusion!
[INFO] Building jar: <https://builds.apache.org/job/Tez-Build/ws/tez-plugins/target/tez-plugins-0.6.0-SNAPSHOT-tests.jar>
[INFO] 
[INFO] --- maven-install-plugin:2.4:install (default-install) @ tez-plugins ---
[INFO] Installing <https://builds.apache.org/job/Tez-Build/ws/tez-plugins/pom.xml> to
/home/jenkins/.m2/repository/org/apache/tez/tez-plugins/0.6.0-SNAPSHOT/tez-plugins-0.6.0-SNAPSHOT.pom
[INFO] Installing <https://builds.apache.org/job/Tez-Build/ws/tez-plugins/target/tez-plugins-0.6.0-SNAPSHOT-tests.jar>
to /home/jenkins/.m2/repository/org/apache/tez/tez-plugins/0.6.0-SNAPSHOT/tez-plugins-0.6.0-SNAPSHOT-tests.jar
[INFO] 
[INFO] --- maven-deploy-plugin:2.8.1:deploy (default-deploy) @ tez-plugins ---
[INFO] Deploying org.apache.tez:tez-plugins:0.6.0-SNAPSHOT at end
[INFO] 
[INFO] --- buildnumber-maven-plugin:1.1:create (default) @ tez-plugins ---
[INFO] Checking for local modifications: skipped.
[INFO] Updating project files from SCM: skipped.
[INFO] Executing: /bin/sh -c cd <https://builds.apache.org/job/Tez-Build/ws/tez-plugins>
&& git rev-parse --verify HEAD
[INFO] Working directory: <https://builds.apache.org/job/Tez-Build/ws/tez-plugins>
[INFO] Storing buildNumber: 976eda9759a378283158c92171a8cda6b0a150d2 at timestamp: 1418410480166
[INFO] Executing: /bin/sh -c cd <https://builds.apache.org/job/Tez-Build/ws/tez-plugins>
&& git rev-parse --verify HEAD
[INFO] Working directory: <https://builds.apache.org/job/Tez-Build/ws/tez-plugins>
[INFO] Storing buildScmBranch: UNKNOWN
[INFO] 
[INFO] --- build-helper-maven-plugin:1.8:maven-version (maven-version) @ tez-plugins ---
[INFO] 
[INFO] --- maven-jar-plugin:2.4:test-jar (default) @ tez-plugins ---
[WARNING] JAR will be empty - no content was marked for inclusion!
[INFO]                                                                         
[INFO] ------------------------------------------------------------------------
[INFO] Skipping tez-yarn-timeline-history-with-acls
[INFO] This project has been banned from the build due to previous failures.
[INFO] ------------------------------------------------------------------------
[INFO]                                                                         
[INFO] ------------------------------------------------------------------------
[INFO] Skipping tez-mbeans-resource-calculator
[INFO] This project has been banned from the build due to previous failures.
[INFO] ------------------------------------------------------------------------
[INFO]                                                                         
[INFO] ------------------------------------------------------------------------
[INFO] Skipping tez-dist
[INFO] This project has been banned from the build due to previous failures.
[INFO] ------------------------------------------------------------------------
[INFO]                                                                         
[INFO] ------------------------------------------------------------------------
[INFO] Building Tez 0.6.0-SNAPSHOT
[INFO] ------------------------------------------------------------------------
[INFO] 
[INFO] --- maven-clean-plugin:2.5:clean (default-clean) @ tez-docs ---
[INFO] Deleting <https://builds.apache.org/job/Tez-Build/ws/docs/target>
[INFO] 
[INFO] --- buildnumber-maven-plugin:1.1:create (default) @ tez-docs ---
[INFO] Checking for local modifications: skipped.
[INFO] Updating project files from SCM: skipped.
[INFO] Executing: /bin/sh -c cd <https://builds.apache.org/job/Tez-Build/ws/docs> &&
git rev-parse --verify HEAD
[INFO] Working directory: <https://builds.apache.org/job/Tez-Build/ws/docs>
[INFO] Storing buildNumber: 976eda9759a378283158c92171a8cda6b0a150d2 at timestamp: 1418410480209
[INFO] Executing: /bin/sh -c cd <https://builds.apache.org/job/Tez-Build/ws/docs> &&
git rev-parse --verify HEAD
[INFO] Working directory: <https://builds.apache.org/job/Tez-Build/ws/docs>
[INFO] Storing buildScmBranch: UNKNOWN
[INFO] 
[INFO] --- build-helper-maven-plugin:1.8:maven-version (maven-version) @ tez-docs ---
[INFO] 
[INFO] --- buildnumber-maven-plugin:1.1:create (default) @ tez-docs ---
[INFO] Checking for local modifications: skipped.
[INFO] Updating project files from SCM: skipped.
[INFO] Executing: /bin/sh -c cd <https://builds.apache.org/job/Tez-Build/ws/docs> &&
git rev-parse --verify HEAD
[INFO] Working directory: <https://builds.apache.org/job/Tez-Build/ws/docs>
[INFO] Storing buildNumber: 976eda9759a378283158c92171a8cda6b0a150d2 at timestamp: 1418410480221
[INFO] Executing: /bin/sh -c cd <https://builds.apache.org/job/Tez-Build/ws/docs> &&
git rev-parse --verify HEAD
[INFO] Working directory: <https://builds.apache.org/job/Tez-Build/ws/docs>
[INFO] Storing buildScmBranch: UNKNOWN
[INFO] 
[INFO] --- build-helper-maven-plugin:1.8:maven-version (maven-version) @ tez-docs ---
[INFO] 
[INFO] --- maven-jar-plugin:2.4:test-jar (default) @ tez-docs ---
[WARNING] JAR will be empty - no content was marked for inclusion!
[INFO] Building jar: <https://builds.apache.org/job/Tez-Build/ws/docs/target/tez-docs-0.6.0-SNAPSHOT-tests.jar>
[INFO] 
[INFO] --- maven-install-plugin:2.4:install (default-install) @ tez-docs ---
[INFO] Installing <https://builds.apache.org/job/Tez-Build/ws/docs/pom.xml> to /home/jenkins/.m2/repository/org/apache/tez/tez-docs/0.6.0-SNAPSHOT/tez-docs-0.6.0-SNAPSHOT.pom
[INFO] Installing <https://builds.apache.org/job/Tez-Build/ws/docs/target/tez-docs-0.6.0-SNAPSHOT-tests.jar>
to /home/jenkins/.m2/repository/org/apache/tez/tez-docs/0.6.0-SNAPSHOT/tez-docs-0.6.0-SNAPSHOT-tests.jar
[INFO] 
[INFO] --- maven-deploy-plugin:2.8.1:deploy (default-deploy) @ tez-docs ---
[INFO] Skipping artifact deployment
[INFO] 
[INFO] --- buildnumber-maven-plugin:1.1:create (default) @ tez-docs ---
[INFO] Checking for local modifications: skipped.
[INFO] Updating project files from SCM: skipped.
[INFO] Executing: /bin/sh -c cd <https://builds.apache.org/job/Tez-Build/ws/docs> &&
git rev-parse --verify HEAD
[INFO] Working directory: <https://builds.apache.org/job/Tez-Build/ws/docs>
[INFO] Storing buildNumber: 976eda9759a378283158c92171a8cda6b0a150d2 at timestamp: 1418410480266
[INFO] Executing: /bin/sh -c cd <https://builds.apache.org/job/Tez-Build/ws/docs> &&
git rev-parse --verify HEAD
[INFO] Working directory: <https://builds.apache.org/job/Tez-Build/ws/docs>
[INFO] Storing buildScmBranch: UNKNOWN
[INFO] 
[INFO] --- build-helper-maven-plugin:1.8:maven-version (maven-version) @ tez-docs ---
[INFO] 
[INFO] --- maven-jar-plugin:2.4:test-jar (default) @ tez-docs ---
[WARNING] JAR will be empty - no content was marked for inclusion!
[INFO] ------------------------------------------------------------------------
[INFO] Reactor Summary:
[INFO] 
[INFO] tez ............................................... SUCCESS [  1.231 s]
[INFO] tez-api ........................................... SUCCESS [ 38.828 s]
[INFO] tez-common ........................................ SUCCESS [  2.040 s]
[INFO] tez-runtime-internals ............................. SUCCESS [  6.032 s]
[INFO] tez-runtime-library ............................... SUCCESS [ 34.884 s]
[INFO] tez-mapreduce ..................................... FAILURE [ 27.277 s]
[INFO] tez-examples ...................................... SKIPPED
[INFO] tez-dag ........................................... FAILURE [03:10 min]
[INFO] tez-tests ......................................... SKIPPED
[INFO] tez-ui ............................................ SUCCESS [ 27.639 s]
[INFO] tez-plugins ....................................... SUCCESS [  0.104 s]
[INFO] tez-yarn-timeline-history-with-acls ............... SKIPPED
[INFO] tez-mbeans-resource-calculator .................... SKIPPED
[INFO] tez-dist .......................................... SKIPPED
[INFO] Tez ............................................... SUCCESS [  0.105 s]
[INFO] ------------------------------------------------------------------------
[INFO] BUILD FAILURE
[INFO] ------------------------------------------------------------------------
[INFO] Total time: 05:29 min
[INFO] Finished at: 2014-12-12T18:54:40+00:00
[INFO] Final Memory: 59M/922M
[INFO] ------------------------------------------------------------------------
[ERROR] Failed to execute goal org.apache.maven.plugins:maven-surefire-plugin:2.14.1:test
(default-test) on project tez-mapreduce: There are test failures.
[ERROR] 
[ERROR] Please refer to <https://builds.apache.org/job/Tez-Build/ws/tez-mapreduce/target/surefire-reports>
for the individual test results.
[ERROR] -> [Help 1]
[ERROR] Failed to execute goal org.apache.maven.plugins:maven-surefire-plugin:2.14.1:test
(default-test) on project tez-dag: There are test failures.
[ERROR] 
[ERROR] Please refer to <https://builds.apache.org/job/Tez-Build/ws/tez-dag/target/surefire-reports>
for the individual test results.
[ERROR] -> [Help 1]
[ERROR] 
[ERROR] To see the full stack trace of the errors, re-run Maven with the -e switch.
[ERROR] Re-run Maven using the -X switch to enable full debug logging.
[ERROR] 
[ERROR] For more information about the errors and possible solutions, please read the following
articles:
[ERROR] [Help 1] http://cwiki.apache.org/confluence/display/MAVEN/MojoFailureException
[ERROR] 
[ERROR] After correcting the problems, you can resume the build with the command
[ERROR]   mvn <goals> -rf :tez-mapreduce
Build step 'Execute shell' marked build as failure
Archiving artifacts
Sending artifact delta relative to Tez-Build #771
Archived 2 artifacts
Archive block size is 32768
Received 0 blocks and 41439668 bytes
Compression is 0.0%
Took 10 sec
Recording test results

Mime
View raw message