tez-dev mailing list archives

Site index · List index
Message view « Date » · « Thread »
Top « Date » · « Thread »
From Apache Jenkins Server <jenk...@builds.apache.org>
Subject Build failed in Jenkins: Tez-Build #766
Date Tue, 02 Dec 2014 19:53:38 GMT
See <https://builds.apache.org/job/Tez-Build/766/changes>

Changes:

[bikas] TEZ-1787. Counters for speculation (bikas)

[hitesh] TEZ-1796. Use of DeprecationDelta broke build against 2.2 Hadoop. (Siddharth Seth
and hitesh via hitesh)

------------------------------------------
[...truncated 1178 lines...]
	at org.apache.tez.dag.app.dag.impl.TaskAttemptImpl$ScheduleTaskattemptTransition.transition(TaskAttemptImpl.java:992)
	at org.apache.hadoop.yarn.state.StateMachineFactory$MultipleInternalArc.doTransition(StateMachineFactory.java:385)
	at org.apache.hadoop.yarn.state.StateMachineFactory.doTransition(StateMachineFactory.java:302)
	at org.apache.hadoop.yarn.state.StateMachineFactory.access$300(StateMachineFactory.java:46)
	at org.apache.hadoop.yarn.state.StateMachineFactory$InternalStateMachine.doTransition(StateMachineFactory.java:448)
	at org.apache.tez.dag.app.dag.impl.TaskAttemptImpl.handle(TaskAttemptImpl.java:670)
	at org.apache.tez.dag.app.dag.impl.TestVertexImpl.testVertexTaskAttemptProcessorFailure(TestVertexImpl.java:2827)

Running org.apache.tez.dag.app.dag.impl.TestDAGImpl
Tests run: 22, Failures: 0, Errors: 1, Skipped: 1, Time elapsed: 7.674 sec <<< FAILURE!
testEdgeManager_GetNumDestinationConsumerTasks(org.apache.tez.dag.app.dag.impl.TestDAGImpl)
 Time elapsed: 5.511 sec  <<< ERROR!
java.lang.Exception: test timed out after 5000 milliseconds
	at java.lang.Thread.yield(Native Method)
	at org.apache.hadoop.yarn.event.DrainDispatcher.await(DrainDispatcher.java:46)
	at org.apache.tez.dag.app.dag.impl.TestDAGImpl.testEdgeManager_GetNumDestinationConsumerTasks(TestDAGImpl.java:1000)

Running org.apache.tez.dag.app.dag.impl.TestVertexManager
Tests run: 2, Failures: 0, Errors: 0, Skipped: 0, Time elapsed: 0.494 sec
Running org.apache.tez.dag.app.dag.impl.TestTaskAttemptRecovery
Tests run: 6, Failures: 0, Errors: 0, Skipped: 0, Time elapsed: 0.704 sec
Running org.apache.tez.dag.app.dag.impl.TestDAGScheduler
Tests run: 1, Failures: 0, Errors: 0, Skipped: 0, Time elapsed: 0.387 sec
Running org.apache.tez.dag.app.dag.impl.TestEdge
Tests run: 1, Failures: 0, Errors: 0, Skipped: 0, Time elapsed: 0.604 sec
Running org.apache.tez.dag.app.dag.impl.TestDAGRecovery
Tests run: 12, Failures: 0, Errors: 0, Skipped: 0, Time elapsed: 1.23 sec
Running org.apache.tez.dag.app.dag.TestStateChangeNotifier
Tests run: 5, Failures: 0, Errors: 0, Skipped: 0, Time elapsed: 0.628 sec
Running org.apache.tez.dag.app.dag.speculation.legacy.TestDataStatistics
Tests run: 4, Failures: 0, Errors: 0, Skipped: 0, Time elapsed: 0.068 sec
Running org.apache.tez.dag.app.TestMockDAGAppMaster
Tests run: 3, Failures: 0, Errors: 0, Skipped: 0, Time elapsed: 4.022 sec
Running org.apache.tez.dag.app.TestRecoveryParser
Tests run: 2, Failures: 0, Errors: 0, Skipped: 0, Time elapsed: 0.705 sec
Running org.apache.tez.dag.app.TestSpeculation
Tests run: 3, Failures: 0, Errors: 0, Skipped: 0, Time elapsed: 4.76 sec
Running org.apache.tez.dag.app.TestPreemption
Tests run: 2, Failures: 0, Errors: 0, Skipped: 0, Time elapsed: 9.165 sec
Running org.apache.tez.dag.app.rm.node.TestAMNodeTracker
Tests run: 4, Failures: 0, Errors: 0, Skipped: 0, Time elapsed: 0.8 sec
Running org.apache.tez.dag.app.rm.TestTaskScheduler
Tests run: 7, Failures: 0, Errors: 0, Skipped: 0, Time elapsed: 3.171 sec
Running org.apache.tez.dag.app.rm.TestTezAMRMClient
Tests run: 1, Failures: 0, Errors: 0, Skipped: 0, Time elapsed: 0.719 sec
Running org.apache.tez.dag.app.rm.container.TestAMContainer
Tests run: 27, Failures: 0, Errors: 0, Skipped: 0, Time elapsed: 0.976 sec
Running org.apache.tez.dag.app.rm.TestLocalTaskSchedulerService
Tests run: 5, Failures: 0, Errors: 0, Skipped: 0, Time elapsed: 0.891 sec
Running org.apache.tez.dag.app.rm.TestContainerReuse
Tests run: 7, Failures: 0, Errors: 0, Skipped: 0, Time elapsed: 29.584 sec
Running org.apache.tez.dag.app.rm.TestLocalTaskScheduler
Tests run: 1, Failures: 0, Errors: 0, Skipped: 0, Time elapsed: 0.565 sec
Running org.apache.tez.dag.app.rm.TestTaskSchedulerEventHandler
Tests run: 4, Failures: 0, Errors: 0, Skipped: 0, Time elapsed: 0.857 sec
Running org.apache.tez.client.TestLocalMode
Tests run: 4, Failures: 0, Errors: 0, Skipped: 0, Time elapsed: 20.868 sec
Running org.apache.tez.runtime.task.TestTaskReporter
Tests run: 1, Failures: 0, Errors: 0, Skipped: 0, Time elapsed: 2.461 sec
Running org.apache.tez.runtime.task.TestTaskExecution
Tests run: 7, Failures: 0, Errors: 0, Skipped: 0, Time elapsed: 1.287 sec

Results :

Tests in error: 
  TestVertexImpl.testVertexTaskAttemptProcessorFailure:2827 »  test timed out af...
  TestDAGImpl.testEdgeManager_GetNumDestinationConsumerTasks:1000 »  test timed ...

Tests run: 289, Failures: 0, Errors: 2, Skipped: 2

[INFO]                                                                         
[INFO] ------------------------------------------------------------------------
[INFO] Skipping tez-tests
[INFO] This project has been banned from the build due to previous failures.
[INFO] ------------------------------------------------------------------------
[INFO]                                                                         
[INFO] ------------------------------------------------------------------------
[INFO] Building tez-plugins 0.6.0-SNAPSHOT
[INFO] ------------------------------------------------------------------------
[INFO] 
[INFO] --- maven-clean-plugin:2.5:clean (default-clean) @ tez-plugins ---
[INFO] Deleting <https://builds.apache.org/job/Tez-Build/ws/tez-plugins/target>
[INFO] 
[INFO] --- buildnumber-maven-plugin:1.1:create (default) @ tez-plugins ---
[INFO] Checking for local modifications: skipped.
[INFO] Updating project files from SCM: skipped.
[INFO] Executing: /bin/sh -c cd <https://builds.apache.org/job/Tez-Build/ws/tez-plugins>
&& git rev-parse --verify HEAD
[INFO] Working directory: <https://builds.apache.org/job/Tez-Build/ws/tez-plugins>
[INFO] Storing buildNumber: 6b531075b37c34885a87c8b4e6bc7cc993cc1c06 at timestamp: 1417549983401
[INFO] Executing: /bin/sh -c cd <https://builds.apache.org/job/Tez-Build/ws/tez-plugins>
&& git rev-parse --verify HEAD
[INFO] Working directory: <https://builds.apache.org/job/Tez-Build/ws/tez-plugins>
[INFO] Storing buildScmBranch: UNKNOWN
[INFO] 
[INFO] --- build-helper-maven-plugin:1.8:maven-version (maven-version) @ tez-plugins ---
[INFO] 
[INFO] --- buildnumber-maven-plugin:1.1:create (default) @ tez-plugins ---
[INFO] Checking for local modifications: skipped.
[INFO] Updating project files from SCM: skipped.
[INFO] Executing: /bin/sh -c cd <https://builds.apache.org/job/Tez-Build/ws/tez-plugins>
&& git rev-parse --verify HEAD
[INFO] Working directory: <https://builds.apache.org/job/Tez-Build/ws/tez-plugins>
[INFO] Storing buildNumber: 6b531075b37c34885a87c8b4e6bc7cc993cc1c06 at timestamp: 1417549983413
[INFO] Executing: /bin/sh -c cd <https://builds.apache.org/job/Tez-Build/ws/tez-plugins>
&& git rev-parse --verify HEAD
[INFO] Working directory: <https://builds.apache.org/job/Tez-Build/ws/tez-plugins>
[INFO] Storing buildScmBranch: UNKNOWN
[INFO] 
[INFO] --- build-helper-maven-plugin:1.8:maven-version (maven-version) @ tez-plugins ---
[INFO] 
[INFO] --- maven-jar-plugin:2.4:test-jar (default) @ tez-plugins ---
[WARNING] JAR will be empty - no content was marked for inclusion!
[INFO] Building jar: <https://builds.apache.org/job/Tez-Build/ws/tez-plugins/target/tez-plugins-0.6.0-SNAPSHOT-tests.jar>
[INFO] 
[INFO] --- maven-install-plugin:2.4:install (default-install) @ tez-plugins ---
[INFO] Installing <https://builds.apache.org/job/Tez-Build/ws/tez-plugins/pom.xml> to
/home/jenkins/.m2/repository/org/apache/tez/tez-plugins/0.6.0-SNAPSHOT/tez-plugins-0.6.0-SNAPSHOT.pom
[INFO] Installing <https://builds.apache.org/job/Tez-Build/ws/tez-plugins/target/tez-plugins-0.6.0-SNAPSHOT-tests.jar>
to /home/jenkins/.m2/repository/org/apache/tez/tez-plugins/0.6.0-SNAPSHOT/tez-plugins-0.6.0-SNAPSHOT-tests.jar
[INFO] 
[INFO] --- maven-deploy-plugin:2.8.1:deploy (default-deploy) @ tez-plugins ---
[INFO] Deploying org.apache.tez:tez-plugins:0.6.0-SNAPSHOT at end
[INFO] 
[INFO] --- buildnumber-maven-plugin:1.1:create (default) @ tez-plugins ---
[INFO] Checking for local modifications: skipped.
[INFO] Updating project files from SCM: skipped.
[INFO] Executing: /bin/sh -c cd <https://builds.apache.org/job/Tez-Build/ws/tez-plugins>
&& git rev-parse --verify HEAD
[INFO] Working directory: <https://builds.apache.org/job/Tez-Build/ws/tez-plugins>
[INFO] Storing buildNumber: 6b531075b37c34885a87c8b4e6bc7cc993cc1c06 at timestamp: 1417549983458
[INFO] Executing: /bin/sh -c cd <https://builds.apache.org/job/Tez-Build/ws/tez-plugins>
&& git rev-parse --verify HEAD
[INFO] Working directory: <https://builds.apache.org/job/Tez-Build/ws/tez-plugins>
[INFO] Storing buildScmBranch: UNKNOWN
[INFO] 
[INFO] --- build-helper-maven-plugin:1.8:maven-version (maven-version) @ tez-plugins ---
[INFO] 
[INFO] --- maven-jar-plugin:2.4:test-jar (default) @ tez-plugins ---
[WARNING] JAR will be empty - no content was marked for inclusion!
[INFO]                                                                         
[INFO] ------------------------------------------------------------------------
[INFO] Skipping tez-yarn-timeline-history
[INFO] This project has been banned from the build due to previous failures.
[INFO] ------------------------------------------------------------------------
[INFO]                                                                         
[INFO] ------------------------------------------------------------------------
[INFO] Skipping tez-mbeans-resource-calculator
[INFO] This project has been banned from the build due to previous failures.
[INFO] ------------------------------------------------------------------------
[INFO]                                                                         
[INFO] ------------------------------------------------------------------------
[INFO] Skipping tez-dist
[INFO] This project has been banned from the build due to previous failures.
[INFO] ------------------------------------------------------------------------
[INFO]                                                                         
[INFO] ------------------------------------------------------------------------
[INFO] Building Tez 0.6.0-SNAPSHOT
[INFO] ------------------------------------------------------------------------
[INFO] 
[INFO] --- maven-clean-plugin:2.5:clean (default-clean) @ tez-docs ---
[INFO] Deleting <https://builds.apache.org/job/Tez-Build/ws/docs/target>
[INFO] 
[INFO] --- buildnumber-maven-plugin:1.1:create (default) @ tez-docs ---
[INFO] Checking for local modifications: skipped.
[INFO] Updating project files from SCM: skipped.
[INFO] Executing: /bin/sh -c cd <https://builds.apache.org/job/Tez-Build/ws/docs> &&
git rev-parse --verify HEAD
[INFO] Working directory: <https://builds.apache.org/job/Tez-Build/ws/docs>
[INFO] Storing buildNumber: 6b531075b37c34885a87c8b4e6bc7cc993cc1c06 at timestamp: 1417549983493
[INFO] Executing: /bin/sh -c cd <https://builds.apache.org/job/Tez-Build/ws/docs> &&
git rev-parse --verify HEAD
[INFO] Working directory: <https://builds.apache.org/job/Tez-Build/ws/docs>
[INFO] Storing buildScmBranch: UNKNOWN
[INFO] 
[INFO] --- build-helper-maven-plugin:1.8:maven-version (maven-version) @ tez-docs ---
[INFO] 
[INFO] --- buildnumber-maven-plugin:1.1:create (default) @ tez-docs ---
[INFO] Checking for local modifications: skipped.
[INFO] Updating project files from SCM: skipped.
[INFO] Executing: /bin/sh -c cd <https://builds.apache.org/job/Tez-Build/ws/docs> &&
git rev-parse --verify HEAD
[INFO] Working directory: <https://builds.apache.org/job/Tez-Build/ws/docs>
[INFO] Storing buildNumber: 6b531075b37c34885a87c8b4e6bc7cc993cc1c06 at timestamp: 1417549983504
[INFO] Executing: /bin/sh -c cd <https://builds.apache.org/job/Tez-Build/ws/docs> &&
git rev-parse --verify HEAD
[INFO] Working directory: <https://builds.apache.org/job/Tez-Build/ws/docs>
[INFO] Storing buildScmBranch: UNKNOWN
[INFO] 
[INFO] --- build-helper-maven-plugin:1.8:maven-version (maven-version) @ tez-docs ---
[INFO] 
[INFO] --- maven-jar-plugin:2.4:test-jar (default) @ tez-docs ---
[WARNING] JAR will be empty - no content was marked for inclusion!
[INFO] Building jar: <https://builds.apache.org/job/Tez-Build/ws/docs/target/tez-docs-0.6.0-SNAPSHOT-tests.jar>
[INFO] 
[INFO] --- maven-install-plugin:2.4:install (default-install) @ tez-docs ---
[INFO] Installing <https://builds.apache.org/job/Tez-Build/ws/docs/pom.xml> to /home/jenkins/.m2/repository/org/apache/tez/tez-docs/0.6.0-SNAPSHOT/tez-docs-0.6.0-SNAPSHOT.pom
[INFO] Installing <https://builds.apache.org/job/Tez-Build/ws/docs/target/tez-docs-0.6.0-SNAPSHOT-tests.jar>
to /home/jenkins/.m2/repository/org/apache/tez/tez-docs/0.6.0-SNAPSHOT/tez-docs-0.6.0-SNAPSHOT-tests.jar
[INFO] 
[INFO] --- maven-deploy-plugin:2.8.1:deploy (default-deploy) @ tez-docs ---
[INFO] Skipping artifact deployment
[INFO] 
[INFO] --- buildnumber-maven-plugin:1.1:create (default) @ tez-docs ---
[INFO] Checking for local modifications: skipped.
[INFO] Updating project files from SCM: skipped.
[INFO] Executing: /bin/sh -c cd <https://builds.apache.org/job/Tez-Build/ws/docs> &&
git rev-parse --verify HEAD
[INFO] Working directory: <https://builds.apache.org/job/Tez-Build/ws/docs>
[INFO] Storing buildNumber: 6b531075b37c34885a87c8b4e6bc7cc993cc1c06 at timestamp: 1417549983543
[INFO] Executing: /bin/sh -c cd <https://builds.apache.org/job/Tez-Build/ws/docs> &&
git rev-parse --verify HEAD
[INFO] Working directory: <https://builds.apache.org/job/Tez-Build/ws/docs>
[INFO] Storing buildScmBranch: UNKNOWN
[INFO] 
[INFO] --- build-helper-maven-plugin:1.8:maven-version (maven-version) @ tez-docs ---
[INFO] 
[INFO] --- maven-jar-plugin:2.4:test-jar (default) @ tez-docs ---
[WARNING] JAR will be empty - no content was marked for inclusion!
[INFO] ------------------------------------------------------------------------
[INFO] Reactor Summary:
[INFO] 
[INFO] tez ............................................... SUCCESS [  1.272 s]
[INFO] tez-api ........................................... SUCCESS [ 35.377 s]
[INFO] tez-common ........................................ SUCCESS [  1.870 s]
[INFO] tez-runtime-internals ............................. SUCCESS [  5.999 s]
[INFO] tez-runtime-library ............................... SUCCESS [ 31.253 s]
[INFO] tez-mapreduce ..................................... SUCCESS [ 17.104 s]
[INFO] tez-examples ...................................... SUCCESS [  0.406 s]
[INFO] tez-dag ........................................... FAILURE [02:06 min]
[INFO] tez-tests ......................................... SKIPPED
[INFO] tez-plugins ....................................... SUCCESS [  0.106 s]
[INFO] tez-yarn-timeline-history ......................... SKIPPED
[INFO] tez-mbeans-resource-calculator .................... SKIPPED
[INFO] tez-dist .......................................... SKIPPED
[INFO] Tez ............................................... SUCCESS [  0.090 s]
[INFO] ------------------------------------------------------------------------
[INFO] BUILD FAILURE
[INFO] ------------------------------------------------------------------------
[INFO] Total time: 03:40 min
[INFO] Finished at: 2014-12-02T19:53:03+00:00
[INFO] Final Memory: 54M/947M
[INFO] ------------------------------------------------------------------------
[ERROR] Failed to execute goal org.apache.maven.plugins:maven-surefire-plugin:2.14.1:test
(default-test) on project tez-dag: There are test failures.
[ERROR] 
[ERROR] Please refer to <https://builds.apache.org/job/Tez-Build/ws/tez-dag/target/surefire-reports>
for the individual test results.
[ERROR] -> [Help 1]
[ERROR] 
[ERROR] To see the full stack trace of the errors, re-run Maven with the -e switch.
[ERROR] Re-run Maven using the -X switch to enable full debug logging.
[ERROR] 
[ERROR] For more information about the errors and possible solutions, please read the following
articles:
[ERROR] [Help 1] http://cwiki.apache.org/confluence/display/MAVEN/MojoFailureException
[ERROR] 
[ERROR] After correcting the problems, you can resume the build with the command
[ERROR]   mvn <goals> -rf :tez-dag
Build step 'Execute shell' marked build as failure
Archiving artifacts
Sending artifact delta relative to Tez-Build #765
Archived 2 artifacts
Archive block size is 32768
Received 0 blocks and 41624787 bytes
Compression is 0.0%
Took 21 sec
Recording test results

Mime
View raw message