tez-dev mailing list archives

Site index · List index
Message view « Date » · « Thread »
Top « Date » · « Thread »
From Apache Jenkins Server <jenk...@builds.apache.org>
Subject Failed: TEZ-1942 PreCommit Build #29
Date Thu, 15 Jan 2015 04:51:49 GMT
Jira: https://issues.apache.org/jira/browse/TEZ-1942
Build: https://builds.apache.org/job/PreCommit-TEZ-Build/29/

###################################################################################
########################## LAST 60 LINES OF THE CONSOLE ###########################
[...truncated 2496 lines...]


{color:red}-1 overall{color}.  Here are the results of testing the latest attachment
  http://issues.apache.org/jira/secure/attachment/12692431/TEZ-1942.1.patch
  against master revision 61bb0f8.

    {color:green}+1 @author{color}.  The patch does not contain any @author tags.

    {color:red}-1 tests included{color}.  The patch doesn't appear to include any new or modified
tests.
                        Please justify why no new tests are needed for this patch.
                        Also please list what manual steps were performed to verify this patch.

    {color:green}+1 javac{color}.  The applied patch does not increase the total number of
javac compiler warnings.

    {color:green}+1 javadoc{color}.  There were no new javadoc warning messages.

    {color:red}-1 findbugs{color}.  The patch appears to introduce 260 new Findbugs (version
2.0.3) warnings.

    {color:green}+1 release audit{color}.  The applied patch does not increase the total number
of release audit warnings.

    {color:red}-1 core tests{color}.  The patch failed these unit tests in :
                   org.apache.tez.dag.history.logging.ats.TestHistoryEventTimelineConversion

Test results: https://builds.apache.org/job/PreCommit-TEZ-Build/29//testReport/
Findbugs warnings: https://builds.apache.org/job/PreCommit-TEZ-Build/29//artifact/patchprocess/newPatchFindbugsWarningstez-runtime-internals.html
Findbugs warnings: https://builds.apache.org/job/PreCommit-TEZ-Build/29//artifact/patchprocess/newPatchFindbugsWarningstez-dag.html
Findbugs warnings: https://builds.apache.org/job/PreCommit-TEZ-Build/29//artifact/patchprocess/newPatchFindbugsWarningstez-examples.html
Findbugs warnings: https://builds.apache.org/job/PreCommit-TEZ-Build/29//artifact/patchprocess/newPatchFindbugsWarningstez-tests.html
Findbugs warnings: https://builds.apache.org/job/PreCommit-TEZ-Build/29//artifact/patchprocess/newPatchFindbugsWarningstez-mapreduce.html
Console output: https://builds.apache.org/job/PreCommit-TEZ-Build/29//console

This message is automatically generated.


======================================================================
======================================================================
    Adding comment to Jira.
======================================================================
======================================================================


Comment added.
92245a4a2830fa46f8cdca191403a7a7bafb4e4b logged out


======================================================================
======================================================================
    Finished build.
======================================================================
======================================================================


Build step 'Execute shell' marked build as failure
Archiving artifacts
No prior successful build to compare, so performing full copy of artifacts
[description-setter] Could not determine description.
Recording test results
Email was triggered for: Failure
Sending email for trigger: Failure



###################################################################################
############################## FAILED TESTS (if any) ##############################
3 tests failed.
FAILED:  org.apache.tez.dag.history.logging.ats.TestHistoryEventTimelineConversion.testConvertVertexFinishedEvent

Error Message:
expected:<2> but was:<3>

Stack Trace:
java.lang.AssertionError: expected:<2> but was:<3>
	at org.junit.Assert.fail(Assert.java:88)
	at org.junit.Assert.failNotEquals(Assert.java:743)
	at org.junit.Assert.assertEquals(Assert.java:118)
	at org.junit.Assert.assertEquals(Assert.java:555)
	at org.junit.Assert.assertEquals(Assert.java:542)
	at org.apache.tez.dag.history.logging.ats.TestHistoryEventTimelineConversion.testConvertVertexFinishedEvent(TestHistoryEventTimelineConversion.java:486)


FAILED:  org.apache.tez.dag.history.logging.ats.TestHistoryEventTimelineConversion.testConvertDAGFinishedEvent

Error Message:
expected:<3> but was:<4>

Stack Trace:
java.lang.AssertionError: expected:<3> but was:<4>
	at org.junit.Assert.fail(Assert.java:88)
	at org.junit.Assert.failNotEquals(Assert.java:743)
	at org.junit.Assert.assertEquals(Assert.java:118)
	at org.junit.Assert.assertEquals(Assert.java:555)
	at org.junit.Assert.assertEquals(Assert.java:542)
	at org.apache.tez.dag.history.logging.ats.TestHistoryEventTimelineConversion.testConvertDAGFinishedEvent(TestHistoryEventTimelineConversion.java:392)


FAILED:  org.apache.tez.dag.history.logging.ats.TestHistoryEventTimelineConversion.testConvertDAGInitializedEvent

Error Message:
expected:<2> but was:<3>

Stack Trace:
java.lang.AssertionError: expected:<2> but was:<3>
	at org.junit.Assert.fail(Assert.java:88)
	at org.junit.Assert.failNotEquals(Assert.java:743)
	at org.junit.Assert.assertEquals(Assert.java:118)
	at org.junit.Assert.assertEquals(Assert.java:555)
	at org.junit.Assert.assertEquals(Assert.java:542)
	at org.apache.tez.dag.history.logging.ats.TestHistoryEventTimelineConversion.testConvertDAGInitializedEvent(TestHistoryEventTimelineConversion.java:354)



Mime
  • Unnamed multipart/mixed (inline, None, 0 bytes)
View raw message