tez-dev mailing list archives

Site index · List index
Message view « Date » · « Thread »
Top « Date » · « Thread »
From Apache Jenkins Server <jenk...@builds.apache.org>
Subject Failed: TEZ-1951 PreCommit Build #33
Date Thu, 15 Jan 2015 20:12:23 GMT
Jira: https://issues.apache.org/jira/browse/TEZ-1951
Build: https://builds.apache.org/job/PreCommit-TEZ-Build/33/

###################################################################################
########################## LAST 60 LINES OF THE CONSOLE ###########################
Started by remote host 127.0.0.1
Building remotely on H7 (Mapreduce Falcon Hadoop Pig Zookeeper Tez Hdfs) in workspace /home/jenkins/jenkins-slave/workspace/PreCommit-TEZ-Build
 > git rev-parse --is-inside-work-tree # timeout=10
Fetching changes from the remote Git repository
 > git config remote.origin.url https://git-wip-us.apache.org/repos/asf/tez.git # timeout=10
Cleaning workspace
 > git rev-parse --verify HEAD # timeout=10
Resetting working tree
 > git reset --hard # timeout=10
 > git clean -fdx # timeout=10
Fetching upstream changes from https://git-wip-us.apache.org/repos/asf/tez.git
 > git --version # timeout=10
FATAL: Failed to fetch from https://git-wip-us.apache.org/repos/asf/tez.git
hudson.plugins.git.GitException: Failed to fetch from https://git-wip-us.apache.org/repos/asf/tez.git
	at hudson.plugins.git.GitSCM.fetchFrom(GitSCM.java:647)
	at hudson.plugins.git.GitSCM.retrieveChanges(GitSCM.java:889)
	at hudson.plugins.git.GitSCM.checkout(GitSCM.java:914)
	at hudson.model.AbstractProject.checkout(AbstractProject.java:1252)
	at hudson.model.AbstractBuild$AbstractBuildExecution.defaultCheckout(AbstractBuild.java:615)
	at jenkins.scm.SCMCheckoutStrategy.checkout(SCMCheckoutStrategy.java:86)
	at hudson.model.AbstractBuild$AbstractBuildExecution.run(AbstractBuild.java:524)
	at hudson.model.Run.execute(Run.java:1706)
	at hudson.model.FreeStyleBuild.run(FreeStyleBuild.java:43)
	at hudson.model.ResourceController.execute(ResourceController.java:88)
	at hudson.model.Executor.run(Executor.java:232)
Caused by: hudson.plugins.git.GitException: Failed to connect to https://git-wip-us.apache.org/repos/asf/tez.git
(status = 503)
	at org.jenkinsci.plugins.gitclient.CliGitAPIImpl.checkCredentials(CliGitAPIImpl.java:2247)
	at org.jenkinsci.plugins.gitclient.CliGitAPIImpl.launchCommandWithCredentials(CliGitAPIImpl.java:1169)
	at org.jenkinsci.plugins.gitclient.CliGitAPIImpl.access$300(CliGitAPIImpl.java:85)
	at org.jenkinsci.plugins.gitclient.CliGitAPIImpl$1.execute(CliGitAPIImpl.java:280)
	at org.jenkinsci.plugins.gitclient.RemoteGitImpl$CommandInvocationHandler$1.call(RemoteGitImpl.java:153)
	at org.jenkinsci.plugins.gitclient.RemoteGitImpl$CommandInvocationHandler$1.call(RemoteGitImpl.java:146)
	at hudson.remoting.UserRequest.perform(UserRequest.java:118)
	at hudson.remoting.UserRequest.perform(UserRequest.java:48)
	at hudson.remoting.Request$2.run(Request.java:328)
	at hudson.remoting.InterceptingExecutorService$1.call(InterceptingExecutorService.java:72)
	at java.util.concurrent.FutureTask.run(FutureTask.java:262)
	at java.util.concurrent.ThreadPoolExecutor.runWorker(ThreadPoolExecutor.java:1145)
	at java.util.concurrent.ThreadPoolExecutor$Worker.run(ThreadPoolExecutor.java:615)
	at java.lang.Thread.run(Thread.java:745)



###################################################################################
############################## FAILED TESTS (if any) ##############################
No tests ran.
Mime
  • Unnamed multipart/mixed (inline, None, 0 bytes)
View raw message