tez-dev mailing list archives

Site index · List index
Message view « Date » · « Thread »
Top « Date » · « Thread »
From Apache Jenkins Server <jenk...@builds.apache.org>
Subject Build failed in Jenkins: Tez-Build-Hadoop-2.4 #58
Date Fri, 27 Mar 2015 01:14:24 GMT
See <https://builds.apache.org/job/Tez-Build-Hadoop-2.4/58/changes>

Changes:

[rbalamohan] TEZ-2196. Consider reusing UnorderedPartitionedKVWriter with single output in
UnorderedKVOutput (rbalamohan)

[bikas] TEZ-2217. The min-held-containers being released prematurely (bikas)

[rbalamohan] TEZ-2213. For the ordered case, enabling pipelined shuffle should automatically
disable final merge (rbalamohan)

[rbalamohan] Updating CHANGES.txt for TEZ-2213

[hitesh] TEZ-2205. Tez still tries to post to ATS when yarn.timeline-service.enabled=false.
(Chang Li via hitesh)

------------------------------------------
[...truncated 1188 lines...]
    - app/bower_components/ember-addons.bs_for_ember/dist/js/bs-label.min.js
    - app/bower_components/antiscroll/antiscroll.js
    - app/bower_components/jquery-mousewheel/jquery.mousewheel.js
    - app/bower_components/ember-table/dist/ember-table.js
    - app/bower_components/ember-addons.bs_for_ember/dist/js/bs-nav.min.js
    - app/bower_components/d3/d3.js

Found a block:
    <!-- build:js(.tmp) scripts/templates.js -->
    <script src="scripts/compiled-templates.js"></script>
    <!-- endbuild -->
Updating config with the following assets:
    - .tmp/scripts/compiled-templates.js

Found a block:
    <!-- build:js(.tmp) scripts/main.js -->
    <script src="scripts/combined-scripts.js"></script>
    <!-- endbuild -->
Updating config with the following assets:
    - .tmp/scripts/combined-scripts.js

Configuration is now:

  cssmin:
  { dist: 
   { files: 
      { '<%= yeoman.dist %>/styles/main.css': 
         [ '.tmp/styles/{,*/}*.css',
           'app/styles/{,*/}*.css',
           'app/bower_components/ember-table/dist/ember-table.css',
           'app/bower_components/font-awesome/css/font-awesome.css',
           'app/bower_components/jquery-ui/themes/smoothness/jquery-ui.css' ] }
},
  'dist/styles/main.css': 'dist/styles/main.css' }

  concat:
  { 'dist/styles/main.css': 
   [ '.tmp/styles/main.css',
     '.tmp/styles/swimlanes.css',
     '.tmp/bower_components/ember-table/dist/ember-table.css',
     '.tmp/bower_components/font-awesome/css/font-awesome.css',
     '.tmp/bower_components/jquery-ui/themes/smoothness/jquery-ui.css' ],
  'dist/scripts/components.js': 
   [ 'app/bower_components/jquery/jquery.js',
     'app/bower_components/jquery-ui/jquery-ui.js',
     'app/bower_components/bootstrap/js/dropdown.js',
     'app/bower_components/bootstrap/js/button.js',
     'app/bower_components/bootstrap/js/tooltip.js',
     'app/bower_components/jquery-ui/ui/datepicker.js',
     'app/bower_components/moment/moment.js',
     'app/bower_components/handlebars/handlebars.js',
     'app/bower_components/ember/ember.js',
     'app/bower_components/ember-data/ember-data.js',
     'app/bower_components/ember-json-mapper/ember-json-mapper.js',
     'app/bower_components/ember-i18n/lib/i18n.js',
     'app/bower_components/ember-addons.bs_for_ember/dist/js/bs-core.min.js',
     'app/bower_components/ember-addons.bs_for_ember/dist/js/bs-basic.min.js',
     'app/bower_components/ember-addons.bs_for_ember/dist/js/bs-button.min.js',
     'app/bower_components/ember-addons.bs_for_ember/dist/js/bs-modal.min.js',
     'app/bower_components/ember-addons.bs_for_ember/dist/js/bs-nav.min.js',
     'app/bower_components/ember-addons.bs_for_ember/dist/js/bs-items-action-bar.min.js',
     'app/bower_components/ember-addons.bs_for_ember/dist/js/bs-badge.min.js',
     'app/bower_components/ember-addons.bs_for_ember/dist/js/bs-label.min.js',
     'app/bower_components/antiscroll/antiscroll.js',
     'app/bower_components/jquery-mousewheel/jquery.mousewheel.js',
     'app/bower_components/ember-table/dist/ember-table.js',
     'app/bower_components/ember-addons.bs_for_ember/dist/js/bs-nav.min.js',
     'app/bower_components/d3/d3.js' ],
  'dist/scripts/templates.js': [ '.tmp/scripts/compiled-templates.js'
],
  'dist/scripts/main.js': [ '.tmp/scripts/combined-scripts.js' ] }

  uglify:
  { 'dist/scripts/components.js': 'dist/scripts/components.js',
  'dist/scripts/templates.js': 'dist/scripts/templates.js',
  'dist/scripts/main.js': 'dist/scripts/main.js' }

  requirejs:
  {}

Running "concurrent:dist" (concurrent) task
    
    Running "htmlmin:dist" (htmlmin) task
    File dist/index.html created.
    
    Done, without errors.
        
    Running "svgmin:dist" (svgmin) task
    
    Done, without errors.
        
    Running "emberTemplates:dist" (emberTemplates) task
    File ".tmp/scripts/compiled-templates.js" created.
    
    Running "emberTemplates:development" (emberTemplates) task
    File ".tmp/scripts/compiled-templates.js" created.
    
    Done, without errors.
    
Running "neuter:app" (neuter) task

Running "less:production" (less) task
File .tmp/styles/styles.css created: 360.18 kB → 292.65 kB

Running "concat:dist/styles/main.css" (concat) task
File "dist/styles/main.css" created.

Running "concat:dist/scripts/components.js" (concat) task
File "dist/scripts/components.js" created.

Running "concat:dist/scripts/templates.js" (concat) task
File "dist/scripts/templates.js" created.

Running "concat:dist/scripts/main.js" (concat) task
File "dist/scripts/main.js" created.

Running "cssmin:dist" (cssmin) task
File dist/styles/main.css created.

Running "cssmin:dist/styles/main.css" (cssmin) task
File dist/styles/main.css created.

Running "copy:dist" (copy) task
Copied 24 files

Running "usemin:html" (usemin) task

Processing as HTML - dist/index.html
Update the HTML to reference our concat/min/revved script files
Update the HTML with the new css filenames
Update the HTML with the new img filenames
Update the HTML with data-main tags
Update the HTML with the data tags
Update the HTML with background imgs, case there is some inline style
Update the HTML with anchors images
Update the HTML with reference in input

Running "usemin:css" (usemin) task

Processing as CSS - dist/styles/main.css
Update the CSS with new img filenames

Done, without errors.
[INFO] 
[INFO] --- maven-resources-plugin:2.6:resources (default-resources) @ tez-ui ---
[INFO] Using 'UTF-8' encoding to copy filtered resources.
[INFO] Copying 2 resources
[INFO] 
[INFO] --- maven-compiler-plugin:3.1:compile (default-compile) @ tez-ui ---
[INFO] No sources to compile
[INFO] 
[INFO] --- maven-resources-plugin:2.6:testResources (default-testResources) @ tez-ui ---
[INFO] Using 'UTF-8' encoding to copy filtered resources.
[INFO] skip non existing resourceDirectory <https://builds.apache.org/job/Tez-Build-Hadoop-2.4/ws/tez-ui/src/test/resources>
[INFO] 
[INFO] --- maven-compiler-plugin:3.1:testCompile (default-testCompile) @ tez-ui ---
[INFO] No sources to compile
[INFO] 
[INFO] --- maven-surefire-plugin:2.14.1:test (default-test) @ tez-ui ---
[INFO] No tests to run.
[INFO]                                                                         
[INFO] ------------------------------------------------------------------------
[INFO] Building tez-plugins 0.7.0-SNAPSHOT
[INFO] ------------------------------------------------------------------------
[INFO] 
[INFO] --- maven-clean-plugin:2.5:clean (default-clean) @ tez-plugins ---
[INFO] 
[INFO] --- buildnumber-maven-plugin:1.1:create (default) @ tez-plugins ---
[INFO] Checking for local modifications: skipped.
[INFO] Updating project files from SCM: skipped.
[INFO] Executing: /bin/sh -c cd <https://builds.apache.org/job/Tez-Build-Hadoop-2.4/ws/tez-plugins>
&& git rev-parse --verify HEAD
[INFO] Working directory: <https://builds.apache.org/job/Tez-Build-Hadoop-2.4/ws/tez-plugins>
[INFO] Storing buildNumber: a4f6dbcecec8c084f10a0879a2960f140879618f at timestamp: 1427418859651
[INFO] Executing: /bin/sh -c cd <https://builds.apache.org/job/Tez-Build-Hadoop-2.4/ws/tez-plugins>
&& git rev-parse --verify HEAD
[INFO] Working directory: <https://builds.apache.org/job/Tez-Build-Hadoop-2.4/ws/tez-plugins>
[INFO] Storing buildScmBranch: UNKNOWN
[INFO] 
[INFO] --- build-helper-maven-plugin:1.8:maven-version (maven-version) @ tez-plugins ---
[INFO]                                                                         
[INFO] ------------------------------------------------------------------------
[INFO] Skipping tez-yarn-timeline-history
[INFO] This project has been banned from the build due to previous failures.
[INFO] ------------------------------------------------------------------------
[INFO]                                                                         
[INFO] ------------------------------------------------------------------------
[INFO] Skipping tez-mbeans-resource-calculator
[INFO] This project has been banned from the build due to previous failures.
[INFO] ------------------------------------------------------------------------
[INFO]                                                                         
[INFO] ------------------------------------------------------------------------
[INFO] Skipping tez-dist
[INFO] This project has been banned from the build due to previous failures.
[INFO] ------------------------------------------------------------------------
[INFO]                                                                         
[INFO] ------------------------------------------------------------------------
[INFO] Building Tez 0.7.0-SNAPSHOT
[INFO] ------------------------------------------------------------------------
[INFO] 
[INFO] --- maven-clean-plugin:2.5:clean (default-clean) @ tez-docs ---
[INFO] 
[INFO] --- buildnumber-maven-plugin:1.1:create (default) @ tez-docs ---
[INFO] Checking for local modifications: skipped.
[INFO] Updating project files from SCM: skipped.
[INFO] Executing: /bin/sh -c cd <https://builds.apache.org/job/Tez-Build-Hadoop-2.4/ws/docs>
&& git rev-parse --verify HEAD
[INFO] Working directory: <https://builds.apache.org/job/Tez-Build-Hadoop-2.4/ws/docs>
[INFO] Storing buildNumber: a4f6dbcecec8c084f10a0879a2960f140879618f at timestamp: 1427418859667
[INFO] Executing: /bin/sh -c cd <https://builds.apache.org/job/Tez-Build-Hadoop-2.4/ws/docs>
&& git rev-parse --verify HEAD
[INFO] Working directory: <https://builds.apache.org/job/Tez-Build-Hadoop-2.4/ws/docs>
[INFO] Storing buildScmBranch: UNKNOWN
[INFO] 
[INFO] --- build-helper-maven-plugin:1.8:maven-version (maven-version) @ tez-docs ---
[INFO] ------------------------------------------------------------------------
[INFO] Reactor Summary:
[INFO] 
[INFO] tez ............................................... SUCCESS [  0.771 s]
[INFO] tez-api ........................................... SUCCESS [ 32.670 s]
[INFO] tez-common ........................................ SUCCESS [  2.423 s]
[INFO] tez-runtime-internals ............................. SUCCESS [ 10.126 s]
[INFO] tez-runtime-library ............................... SUCCESS [01:03 min]
[INFO] tez-mapreduce ..................................... SUCCESS [ 22.482 s]
[INFO] tez-examples ...................................... SUCCESS [  0.240 s]
[INFO] tez-dag ........................................... FAILURE [01:35 min]
[INFO] tez-tests ......................................... SKIPPED
[INFO] tez-ui ............................................ SUCCESS [ 15.251 s]
[INFO] tez-plugins ....................................... SUCCESS [  0.015 s]
[INFO] tez-yarn-timeline-history ......................... SKIPPED
[INFO] tez-mbeans-resource-calculator .................... SKIPPED
[INFO] tez-dist .......................................... SKIPPED
[INFO] Tez ............................................... SUCCESS [  0.015 s]
[INFO] ------------------------------------------------------------------------
[INFO] BUILD FAILURE
[INFO] ------------------------------------------------------------------------
[INFO] Total time: 04:04 min
[INFO] Finished at: 2015-03-27T01:14:19+00:00
[INFO] Final Memory: 56M/856M
[INFO] ------------------------------------------------------------------------
[ERROR] Failed to execute goal org.apache.maven.plugins:maven-surefire-plugin:2.14.1:test
(default-test) on project tez-dag: There are test failures.
[ERROR] 
[ERROR] Please refer to <https://builds.apache.org/job/Tez-Build-Hadoop-2.4/ws/tez-dag/target/surefire-reports>
for the individual test results.
[ERROR] -> [Help 1]
[ERROR] 
[ERROR] To see the full stack trace of the errors, re-run Maven with the -e switch.
[ERROR] Re-run Maven using the -X switch to enable full debug logging.
[ERROR] 
[ERROR] For more information about the errors and possible solutions, please read the following
articles:
[ERROR] [Help 1] http://cwiki.apache.org/confluence/display/MAVEN/MojoFailureException
[ERROR] 
[ERROR] After correcting the problems, you can resume the build with the command
[ERROR]   mvn <goals> -rf :tez-dag
Build step 'Execute shell' marked build as failure
Recording test results

Mime
View raw message