tez-dev mailing list archives

Site index · List index
Message view « Date » · « Thread »
Top « Date » · « Thread »
From Apache Jenkins Server <jenk...@builds.apache.org>
Subject Build failed in Jenkins: Tez-Build #964
Date Tue, 31 Mar 2015 08:30:25 GMT
See <https://builds.apache.org/job/Tez-Build/964/changes>

Changes:

[zjffdu] TEZ-2224. Fix compilation failure (zjffdu)

------------------------------------------
[...truncated 2308 lines...]
[INFO] 
[INFO] --- maven-jar-plugin:2.4:test-jar (default) @ tez-plugins ---
[WARNING] JAR will be empty - no content was marked for inclusion!
[INFO]                                                                         
[INFO] ------------------------------------------------------------------------
[INFO] Skipping tez-yarn-timeline-history
[INFO] This project has been banned from the build due to previous failures.
[INFO] ------------------------------------------------------------------------
[INFO]                                                                         
[INFO] ------------------------------------------------------------------------
[INFO] Skipping tez-yarn-timeline-history-with-acls
[INFO] This project has been banned from the build due to previous failures.
[INFO] ------------------------------------------------------------------------
[INFO]                                                                         
[INFO] ------------------------------------------------------------------------
[INFO] Building tez-mbeans-resource-calculator 0.7.0-SNAPSHOT
[INFO] ------------------------------------------------------------------------
[INFO] 
[INFO] --- maven-clean-plugin:2.5:clean (default-clean) @ tez-mbeans-resource-calculator ---
[INFO] Deleting <https://builds.apache.org/job/Tez-Build/ws/tez-plugins/tez-mbeans-resource-calculator/target>
[INFO] 
[INFO] --- buildnumber-maven-plugin:1.1:create (default) @ tez-mbeans-resource-calculator
---
[INFO] Checking for local modifications: skipped.
[INFO] Updating project files from SCM: skipped.
[INFO] Executing: /bin/sh -c cd <https://builds.apache.org/job/Tez-Build/ws/tez-plugins/tez-mbeans-resource-calculator>
&& git rev-parse --verify HEAD
[INFO] Working directory: <https://builds.apache.org/job/Tez-Build/ws/tez-plugins/tez-mbeans-resource-calculator>
[INFO] Storing buildNumber: 3bfe003058c3a902c4544308289a32f3a6b97f71 at timestamp: 1427790612610
[INFO] Executing: /bin/sh -c cd <https://builds.apache.org/job/Tez-Build/ws/tez-plugins/tez-mbeans-resource-calculator>
&& git rev-parse --verify HEAD
[INFO] Working directory: <https://builds.apache.org/job/Tez-Build/ws/tez-plugins/tez-mbeans-resource-calculator>
[INFO] Storing buildScmBranch: UNKNOWN
[INFO] 
[INFO] --- build-helper-maven-plugin:1.8:maven-version (maven-version) @ tez-mbeans-resource-calculator
---
[INFO] 
[INFO] --- maven-resources-plugin:2.6:resources (default-resources) @ tez-mbeans-resource-calculator
---
[INFO] Using 'UTF-8' encoding to copy filtered resources.
[INFO] skip non existing resourceDirectory <https://builds.apache.org/job/Tez-Build/ws/tez-plugins/tez-mbeans-resource-calculator/src/main/resources>
[INFO] 
[INFO] --- maven-compiler-plugin:3.1:compile (default-compile) @ tez-mbeans-resource-calculator
---
[INFO] Changes detected - recompiling the module!
[INFO] Compiling 1 source file to <https://builds.apache.org/job/Tez-Build/ws/tez-plugins/tez-mbeans-resource-calculator/target/classes>
[INFO] 
[INFO] --- maven-resources-plugin:2.6:testResources (default-testResources) @ tez-mbeans-resource-calculator
---
[INFO] Using 'UTF-8' encoding to copy filtered resources.
[INFO] skip non existing resourceDirectory <https://builds.apache.org/job/Tez-Build/ws/tez-plugins/tez-mbeans-resource-calculator/src/test/resources>
[INFO] 
[INFO] --- maven-compiler-plugin:3.1:testCompile (default-testCompile) @ tez-mbeans-resource-calculator
---
[INFO] Changes detected - recompiling the module!
[INFO] Compiling 1 source file to <https://builds.apache.org/job/Tez-Build/ws/tez-plugins/tez-mbeans-resource-calculator/target/test-classes>
[INFO] 
[INFO] --- maven-surefire-plugin:2.14.1:test (default-test) @ tez-mbeans-resource-calculator
---
[INFO] Surefire report directory: <https://builds.apache.org/job/Tez-Build/ws/tez-plugins/tez-mbeans-resource-calculator/target/surefire-reports>

-------------------------------------------------------
 T E S T S
-------------------------------------------------------

-------------------------------------------------------
 T E S T S
-------------------------------------------------------
Running org.apache.tez.util.TestTezMxBeanResourceCalculator
Tests run: 1, Failures: 0, Errors: 0, Skipped: 0, Time elapsed: 0.46 sec

Results :

Tests run: 1, Failures: 0, Errors: 0, Skipped: 0

[INFO] 
[INFO] --- buildnumber-maven-plugin:1.1:create (default) @ tez-mbeans-resource-calculator
---
[INFO] Checking for local modifications: skipped.
[INFO] Updating project files from SCM: skipped.
[INFO] Executing: /bin/sh -c cd <https://builds.apache.org/job/Tez-Build/ws/tez-plugins/tez-mbeans-resource-calculator>
&& git rev-parse --verify HEAD
[INFO] Working directory: <https://builds.apache.org/job/Tez-Build/ws/tez-plugins/tez-mbeans-resource-calculator>
[INFO] Storing buildNumber: 3bfe003058c3a902c4544308289a32f3a6b97f71 at timestamp: 1427790613407
[INFO] Executing: /bin/sh -c cd <https://builds.apache.org/job/Tez-Build/ws/tez-plugins/tez-mbeans-resource-calculator>
&& git rev-parse --verify HEAD
[INFO] Working directory: <https://builds.apache.org/job/Tez-Build/ws/tez-plugins/tez-mbeans-resource-calculator>
[INFO] Storing buildScmBranch: UNKNOWN
[INFO] 
[INFO] --- build-helper-maven-plugin:1.8:maven-version (maven-version) @ tez-mbeans-resource-calculator
---
[INFO] 
[INFO] --- maven-resources-plugin:2.6:resources (default-resources) @ tez-mbeans-resource-calculator
---
[INFO] Using 'UTF-8' encoding to copy filtered resources.
[INFO] skip non existing resourceDirectory <https://builds.apache.org/job/Tez-Build/ws/tez-plugins/tez-mbeans-resource-calculator/src/main/resources>
[INFO] 
[INFO] --- maven-compiler-plugin:3.1:compile (default-compile) @ tez-mbeans-resource-calculator
---
[INFO] Nothing to compile - all classes are up to date
[INFO] 
[INFO] --- maven-resources-plugin:2.6:testResources (default-testResources) @ tez-mbeans-resource-calculator
---
[INFO] Using 'UTF-8' encoding to copy filtered resources.
[INFO] skip non existing resourceDirectory <https://builds.apache.org/job/Tez-Build/ws/tez-plugins/tez-mbeans-resource-calculator/src/test/resources>
[INFO] 
[INFO] --- maven-compiler-plugin:3.1:testCompile (default-testCompile) @ tez-mbeans-resource-calculator
---
[INFO] Nothing to compile - all classes are up to date
[INFO] 
[INFO] --- maven-surefire-plugin:2.14.1:test (default-test) @ tez-mbeans-resource-calculator
---
[INFO] Skipping execution of surefire because it has already been run for this configuration
[INFO] 
[INFO] --- maven-jar-plugin:2.4:jar (default-jar) @ tez-mbeans-resource-calculator ---
[INFO] Building jar: <https://builds.apache.org/job/Tez-Build/ws/tez-plugins/tez-mbeans-resource-calculator/target/tez-mbeans-resource-calculator-0.7.0-SNAPSHOT.jar>
[INFO] 
[INFO] --- maven-jar-plugin:2.4:test-jar (default) @ tez-mbeans-resource-calculator ---
[INFO] Building jar: <https://builds.apache.org/job/Tez-Build/ws/tez-plugins/tez-mbeans-resource-calculator/target/tez-mbeans-resource-calculator-0.7.0-SNAPSHOT-tests.jar>
[INFO] 
[INFO] --- maven-install-plugin:2.4:install (default-install) @ tez-mbeans-resource-calculator
---
[INFO] Installing <https://builds.apache.org/job/Tez-Build/ws/tez-plugins/tez-mbeans-resource-calculator/target/tez-mbeans-resource-calculator-0.7.0-SNAPSHOT.jar>
to /home/jenkins/.m2/repository/org/apache/tez/tez-mbeans-resource-calculator/0.7.0-SNAPSHOT/tez-mbeans-resource-calculator-0.7.0-SNAPSHOT.jar
[INFO] Installing <https://builds.apache.org/job/Tez-Build/ws/tez-plugins/tez-mbeans-resource-calculator/pom.xml>
to /home/jenkins/.m2/repository/org/apache/tez/tez-mbeans-resource-calculator/0.7.0-SNAPSHOT/tez-mbeans-resource-calculator-0.7.0-SNAPSHOT.pom
[INFO] Installing <https://builds.apache.org/job/Tez-Build/ws/tez-plugins/tez-mbeans-resource-calculator/target/tez-mbeans-resource-calculator-0.7.0-SNAPSHOT-tests.jar>
to /home/jenkins/.m2/repository/org/apache/tez/tez-mbeans-resource-calculator/0.7.0-SNAPSHOT/tez-mbeans-resource-calculator-0.7.0-SNAPSHOT-tests.jar
[INFO] 
[INFO] --- maven-deploy-plugin:2.8.1:deploy (default-deploy) @ tez-mbeans-resource-calculator
---
[INFO] Deploying org.apache.tez:tez-mbeans-resource-calculator:0.7.0-SNAPSHOT at end
[INFO] 
[INFO] --- buildnumber-maven-plugin:1.1:create (default) @ tez-mbeans-resource-calculator
---
[INFO] Checking for local modifications: skipped.
[INFO] Updating project files from SCM: skipped.
[INFO] Executing: /bin/sh -c cd <https://builds.apache.org/job/Tez-Build/ws/tez-plugins/tez-mbeans-resource-calculator>
&& git rev-parse --verify HEAD
[INFO] Working directory: <https://builds.apache.org/job/Tez-Build/ws/tez-plugins/tez-mbeans-resource-calculator>
[INFO] Storing buildNumber: 3bfe003058c3a902c4544308289a32f3a6b97f71 at timestamp: 1427790613491
[INFO] Executing: /bin/sh -c cd <https://builds.apache.org/job/Tez-Build/ws/tez-plugins/tez-mbeans-resource-calculator>
&& git rev-parse --verify HEAD
[INFO] Working directory: <https://builds.apache.org/job/Tez-Build/ws/tez-plugins/tez-mbeans-resource-calculator>
[INFO] Storing buildScmBranch: UNKNOWN
[INFO] 
[INFO] --- build-helper-maven-plugin:1.8:maven-version (maven-version) @ tez-mbeans-resource-calculator
---
[INFO] 
[INFO] --- maven-resources-plugin:2.6:resources (default-resources) @ tez-mbeans-resource-calculator
---
[INFO] Using 'UTF-8' encoding to copy filtered resources.
[INFO] skip non existing resourceDirectory <https://builds.apache.org/job/Tez-Build/ws/tez-plugins/tez-mbeans-resource-calculator/src/main/resources>
[INFO] 
[INFO] --- maven-compiler-plugin:3.1:compile (default-compile) @ tez-mbeans-resource-calculator
---
[INFO] Nothing to compile - all classes are up to date
[INFO] 
[INFO] --- maven-resources-plugin:2.6:testResources (default-testResources) @ tez-mbeans-resource-calculator
---
[INFO] Using 'UTF-8' encoding to copy filtered resources.
[INFO] skip non existing resourceDirectory <https://builds.apache.org/job/Tez-Build/ws/tez-plugins/tez-mbeans-resource-calculator/src/test/resources>
[INFO] 
[INFO] --- maven-compiler-plugin:3.1:testCompile (default-testCompile) @ tez-mbeans-resource-calculator
---
[INFO] Nothing to compile - all classes are up to date
[INFO] 
[INFO] --- maven-surefire-plugin:2.14.1:test (default-test) @ tez-mbeans-resource-calculator
---
[INFO] Skipping execution of surefire because it has already been run for this configuration
[INFO] 
[INFO] --- maven-jar-plugin:2.4:jar (default-jar) @ tez-mbeans-resource-calculator ---
[INFO] 
[INFO] --- maven-jar-plugin:2.4:test-jar (default) @ tez-mbeans-resource-calculator ---
[INFO]                                                                         
[INFO] ------------------------------------------------------------------------
[INFO] Skipping tez-dist
[INFO] This project has been banned from the build due to previous failures.
[INFO] ------------------------------------------------------------------------
[INFO]                                                                         
[INFO] ------------------------------------------------------------------------
[INFO] Building Tez 0.7.0-SNAPSHOT
[INFO] ------------------------------------------------------------------------
[INFO] 
[INFO] --- maven-clean-plugin:2.5:clean (default-clean) @ tez-docs ---
[INFO] Deleting <https://builds.apache.org/job/Tez-Build/ws/docs/target>
[INFO] 
[INFO] --- buildnumber-maven-plugin:1.1:create (default) @ tez-docs ---
[INFO] Checking for local modifications: skipped.
[INFO] Updating project files from SCM: skipped.
[INFO] Executing: /bin/sh -c cd <https://builds.apache.org/job/Tez-Build/ws/docs> &&
git rev-parse --verify HEAD
[INFO] Working directory: <https://builds.apache.org/job/Tez-Build/ws/docs>
[INFO] Storing buildNumber: 3bfe003058c3a902c4544308289a32f3a6b97f71 at timestamp: 1427790613578
[INFO] Executing: /bin/sh -c cd <https://builds.apache.org/job/Tez-Build/ws/docs> &&
git rev-parse --verify HEAD
[INFO] Working directory: <https://builds.apache.org/job/Tez-Build/ws/docs>
[INFO] Storing buildScmBranch: UNKNOWN
[INFO] 
[INFO] --- build-helper-maven-plugin:1.8:maven-version (maven-version) @ tez-docs ---
[INFO] 
[INFO] --- buildnumber-maven-plugin:1.1:create (default) @ tez-docs ---
[INFO] Checking for local modifications: skipped.
[INFO] Updating project files from SCM: skipped.
[INFO] Executing: /bin/sh -c cd <https://builds.apache.org/job/Tez-Build/ws/docs> &&
git rev-parse --verify HEAD
[INFO] Working directory: <https://builds.apache.org/job/Tez-Build/ws/docs>
[INFO] Storing buildNumber: 3bfe003058c3a902c4544308289a32f3a6b97f71 at timestamp: 1427790613589
[INFO] Executing: /bin/sh -c cd <https://builds.apache.org/job/Tez-Build/ws/docs> &&
git rev-parse --verify HEAD
[INFO] Working directory: <https://builds.apache.org/job/Tez-Build/ws/docs>
[INFO] Storing buildScmBranch: UNKNOWN
[INFO] 
[INFO] --- build-helper-maven-plugin:1.8:maven-version (maven-version) @ tez-docs ---
[INFO] 
[INFO] --- maven-jar-plugin:2.4:test-jar (default) @ tez-docs ---
[WARNING] JAR will be empty - no content was marked for inclusion!
[INFO] Building jar: <https://builds.apache.org/job/Tez-Build/ws/docs/target/tez-docs-0.7.0-SNAPSHOT-tests.jar>
[INFO] 
[INFO] --- maven-install-plugin:2.4:install (default-install) @ tez-docs ---
[INFO] Installing <https://builds.apache.org/job/Tez-Build/ws/docs/pom.xml> to /home/jenkins/.m2/repository/org/apache/tez/tez-docs/0.7.0-SNAPSHOT/tez-docs-0.7.0-SNAPSHOT.pom
[INFO] Installing <https://builds.apache.org/job/Tez-Build/ws/docs/target/tez-docs-0.7.0-SNAPSHOT-tests.jar>
to /home/jenkins/.m2/repository/org/apache/tez/tez-docs/0.7.0-SNAPSHOT/tez-docs-0.7.0-SNAPSHOT-tests.jar
[INFO] 
[INFO] --- maven-deploy-plugin:2.8.1:deploy (default-deploy) @ tez-docs ---
[INFO] Skipping artifact deployment
[INFO] 
[INFO] --- buildnumber-maven-plugin:1.1:create (default) @ tez-docs ---
[INFO] Checking for local modifications: skipped.
[INFO] Updating project files from SCM: skipped.
[INFO] Executing: /bin/sh -c cd <https://builds.apache.org/job/Tez-Build/ws/docs> &&
git rev-parse --verify HEAD
[INFO] Working directory: <https://builds.apache.org/job/Tez-Build/ws/docs>
[INFO] Storing buildNumber: 3bfe003058c3a902c4544308289a32f3a6b97f71 at timestamp: 1427790613632
[INFO] Executing: /bin/sh -c cd <https://builds.apache.org/job/Tez-Build/ws/docs> &&
git rev-parse --verify HEAD
[INFO] Working directory: <https://builds.apache.org/job/Tez-Build/ws/docs>
[INFO] Storing buildScmBranch: UNKNOWN
[INFO] 
[INFO] --- build-helper-maven-plugin:1.8:maven-version (maven-version) @ tez-docs ---
[INFO] 
[INFO] --- maven-jar-plugin:2.4:test-jar (default) @ tez-docs ---
[WARNING] JAR will be empty - no content was marked for inclusion!
[INFO] ------------------------------------------------------------------------
[INFO] Reactor Summary:
[INFO] 
[INFO] tez ............................................... SUCCESS [  1.200 s]
[INFO] tez-api ........................................... SUCCESS [ 43.746 s]
[INFO] tez-common ........................................ SUCCESS [  2.774 s]
[INFO] tez-runtime-internals ............................. SUCCESS [ 10.540 s]
[INFO] tez-runtime-library ............................... SUCCESS [01:07 min]
[INFO] tez-mapreduce ..................................... SUCCESS [ 24.374 s]
[INFO] tez-examples ...................................... SUCCESS [  0.394 s]
[INFO] tez-dag ........................................... SUCCESS [01:40 min]
[INFO] tez-tests ......................................... FAILURE [34:07 min]
[INFO] tez-ui ............................................ SUCCESS [ 31.817 s]
[INFO] tez-plugins ....................................... SUCCESS [  0.101 s]
[INFO] tez-yarn-timeline-history ......................... SKIPPED
[INFO] tez-yarn-timeline-history-with-acls ............... SKIPPED
[INFO] tez-mbeans-resource-calculator .................... SUCCESS [  1.032 s]
[INFO] tez-dist .......................................... SKIPPED
[INFO] Tez ............................................... SUCCESS [  0.090 s]
[INFO] ------------------------------------------------------------------------
[INFO] BUILD FAILURE
[INFO] ------------------------------------------------------------------------
[INFO] Total time: 38:52 min
[INFO] Finished at: 2015-03-31T08:30:13+00:00
[INFO] Final Memory: 63M/861M
[INFO] ------------------------------------------------------------------------
[ERROR] Failed to execute goal org.apache.maven.plugins:maven-surefire-plugin:2.14.1:test
(default-test) on project tez-tests: There was a timeout or other error in the fork ->
[Help 1]
[ERROR] 
[ERROR] To see the full stack trace of the errors, re-run Maven with the -e switch.
[ERROR] Re-run Maven using the -X switch to enable full debug logging.
[ERROR] 
[ERROR] For more information about the errors and possible solutions, please read the following
articles:
[ERROR] [Help 1] http://cwiki.apache.org/confluence/display/MAVEN/MojoFailureException
[ERROR] 
[ERROR] After correcting the problems, you can resume the build with the command
[ERROR]   mvn <goals> -rf :tez-tests
Build step 'Execute shell' marked build as failure
Archiving artifacts
Sending artifact delta relative to Tez-Build #962
Archived 2 artifacts
Archive block size is 32768
Received 1564 blocks and 5644 bytes
Compression is 100.0%
Took 7.3 sec
Recording test results

Mime
View raw message