tez-dev mailing list archives

Site index · List index
Message view « Date » · « Thread »
Top « Date » · « Thread »
From Apache Jenkins Server <jenk...@builds.apache.org>
Subject Build failed in Jenkins: Tez-Build-Hadoop-2.2 #112
Date Fri, 05 Jun 2015 00:04:02 GMT
See <https://builds.apache.org/job/Tez-Build-Hadoop-2.2/112/changes>

Changes:

[hitesh] TEZ-2489. Disable warn log for Timeline ACL error when tez.allow.disabled.timeline-domains
set to true. (Chang Li via hitesh)

[jeagles] TEZ-2537. mapreduce.map.env and mapreduce.reduce.env need to fall back to mapred.child.env
for compatibility (Rohini Palaniswamy via jeagles)

[rbalamohan] TEZ-2538. ADDITIONAL_SPILL_COUNT wrongly populated for DefaultSorter with multiple
partitions (rbalamohan)

------------------------------------------
[...truncated 1023 lines...]
     'app/bower_components/d3/d3.js',
     'app/bower_components/zip.js/WebContent/zip.js',
     'app/bower_components/FileSaver.js/FileSaver.min.js',
     'app/bower_components/codemirror/lib/codemirror.js',
     'app/bower_components/codemirror/mode/sql/sql.js',
     'app/bower_components/codemirror/mode/pig/pig.js' ],
  'dist/scripts/templates.js': [ '.tmp/scripts/compiled-templates.js'
],
  'dist/scripts/main.js': [ '.tmp/scripts/combined-scripts.js' ] }

  uglify:
  { 'dist/scripts/components.js': 'dist/scripts/components.js',
  'dist/scripts/templates.js': 'dist/scripts/templates.js',
  'dist/scripts/main.js': 'dist/scripts/main.js' }

  requirejs:
  {}

Running "concurrent:dist" (concurrent) task
    
    Running "htmlmin:dist" (htmlmin) task
    File dist/index.html created.
    
    Done, without errors.
        
    Running "svgmin:dist" (svgmin) task
    
    Done, without errors.
        
    Running "emberTemplates:dist" (emberTemplates) task
    File ".tmp/scripts/compiled-templates.js" created.
    
    Running "emberTemplates:development" (emberTemplates) task
    File ".tmp/scripts/compiled-templates.js" created.
    
    Done, without errors.
    
Running "neuter:app" (neuter) task

Running "less:production" (less) task
File .tmp/styles/styles.css created: 383.9 kB → 314.57 kB

Running "concat:dist/styles/main.css" (concat) task
File "dist/styles/main.css" created.

Running "concat:dist/scripts/components.js" (concat) task
File "dist/scripts/components.js" created.

Running "concat:dist/scripts/templates.js" (concat) task
File "dist/scripts/templates.js" created.

Running "concat:dist/scripts/main.js" (concat) task
File "dist/scripts/main.js" created.

Running "cssmin:dist" (cssmin) task
File dist/styles/main.css created.

Running "cssmin:dist/styles/main.css" (cssmin) task
File dist/styles/main.css created.

Running "copy:dist" (copy) task
Copied 27 files

Running "usemin:html" (usemin) task

Processing as HTML - dist/index.html
Update the HTML to reference our concat/min/revved script files
Update the HTML with the new css filenames
Update the HTML with the new img filenames
Update the HTML with data-main tags
Update the HTML with the data tags
Update the HTML with background imgs, case there is some inline style
Update the HTML with anchors images
Update the HTML with reference in input

Running "usemin:css" (usemin) task

Processing as CSS - dist/styles/main.css
Update the CSS with new img filenames

Done, without errors.
[INFO] 
[INFO] --- maven-resources-plugin:2.6:resources (default-resources) @ tez-ui ---
[INFO] Using 'UTF-8' encoding to copy filtered resources.
[INFO] Copying 2 resources
[INFO] 
[INFO] --- maven-compiler-plugin:3.1:compile (default-compile) @ tez-ui ---
[INFO] No sources to compile
[INFO] 
[INFO] --- maven-resources-plugin:2.6:testResources (default-testResources) @ tez-ui ---
[INFO] Using 'UTF-8' encoding to copy filtered resources.
[INFO] skip non existing resourceDirectory <https://builds.apache.org/job/Tez-Build-Hadoop-2.2/ws/tez-ui/src/test/resources>
[INFO] 
[INFO] --- maven-compiler-plugin:3.1:testCompile (default-testCompile) @ tez-ui ---
[INFO] No sources to compile
[INFO] 
[INFO] --- maven-surefire-plugin:2.14.1:test (default-test) @ tez-ui ---
[INFO] No tests to run.
[INFO]                                                                         
[INFO] ------------------------------------------------------------------------
[INFO] Building tez-plugins 0.8.0-SNAPSHOT
[INFO] ------------------------------------------------------------------------
[INFO] 
[INFO] --- maven-clean-plugin:2.5:clean (default-clean) @ tez-plugins ---
[INFO] 
[INFO] --- buildnumber-maven-plugin:1.1:create (default) @ tez-plugins ---
[INFO] Checking for local modifications: skipped.
[INFO] Updating project files from SCM: skipped.
[INFO] Executing: /bin/sh -c cd <https://builds.apache.org/job/Tez-Build-Hadoop-2.2/ws/tez-plugins>
&& git rev-parse --verify HEAD
[INFO] Working directory: <https://builds.apache.org/job/Tez-Build-Hadoop-2.2/ws/tez-plugins>
[INFO] Storing buildNumber: fa5ae1ac2b8240e00abedf995b29c43c7af993fd at timestamp: 1433462636605
[INFO] Executing: /bin/sh -c cd <https://builds.apache.org/job/Tez-Build-Hadoop-2.2/ws/tez-plugins>
&& git rev-parse --verify HEAD
[INFO] Working directory: <https://builds.apache.org/job/Tez-Build-Hadoop-2.2/ws/tez-plugins>
[INFO] Storing buildScmBranch: UNKNOWN
[INFO] 
[INFO] --- build-helper-maven-plugin:1.8:maven-version (maven-version) @ tez-plugins ---
[INFO]                                                                         
[INFO] ------------------------------------------------------------------------
[INFO] Building tez-mbeans-resource-calculator 0.8.0-SNAPSHOT
[INFO] ------------------------------------------------------------------------
[INFO] 
[INFO] --- maven-clean-plugin:2.5:clean (default-clean) @ tez-mbeans-resource-calculator ---
[INFO] Deleting <https://builds.apache.org/job/Tez-Build-Hadoop-2.2/ws/tez-plugins/tez-mbeans-resource-calculator/target>
[INFO] 
[INFO] --- buildnumber-maven-plugin:1.1:create (default) @ tez-mbeans-resource-calculator
---
[INFO] Checking for local modifications: skipped.
[INFO] Updating project files from SCM: skipped.
[INFO] Executing: /bin/sh -c cd <https://builds.apache.org/job/Tez-Build-Hadoop-2.2/ws/tez-plugins/tez-mbeans-resource-calculator>
&& git rev-parse --verify HEAD
[INFO] Working directory: <https://builds.apache.org/job/Tez-Build-Hadoop-2.2/ws/tez-plugins/tez-mbeans-resource-calculator>
[INFO] Storing buildNumber: fa5ae1ac2b8240e00abedf995b29c43c7af993fd at timestamp: 1433462636682
[INFO] Executing: /bin/sh -c cd <https://builds.apache.org/job/Tez-Build-Hadoop-2.2/ws/tez-plugins/tez-mbeans-resource-calculator>
&& git rev-parse --verify HEAD
[INFO] Working directory: <https://builds.apache.org/job/Tez-Build-Hadoop-2.2/ws/tez-plugins/tez-mbeans-resource-calculator>
[INFO] Storing buildScmBranch: UNKNOWN
[INFO] 
[INFO] --- build-helper-maven-plugin:1.8:maven-version (maven-version) @ tez-mbeans-resource-calculator
---
[INFO] 
[INFO] --- maven-resources-plugin:2.6:resources (default-resources) @ tez-mbeans-resource-calculator
---
[INFO] Using 'UTF-8' encoding to copy filtered resources.
[INFO] skip non existing resourceDirectory <https://builds.apache.org/job/Tez-Build-Hadoop-2.2/ws/tez-plugins/tez-mbeans-resource-calculator/src/main/resources>
[INFO] 
[INFO] --- maven-compiler-plugin:3.1:compile (default-compile) @ tez-mbeans-resource-calculator
---
[INFO] Changes detected - recompiling the module!
[INFO] Compiling 1 source file to <https://builds.apache.org/job/Tez-Build-Hadoop-2.2/ws/tez-plugins/tez-mbeans-resource-calculator/target/classes>
[INFO] 
[INFO] --- maven-resources-plugin:2.6:testResources (default-testResources) @ tez-mbeans-resource-calculator
---
[INFO] Using 'UTF-8' encoding to copy filtered resources.
[INFO] skip non existing resourceDirectory <https://builds.apache.org/job/Tez-Build-Hadoop-2.2/ws/tez-plugins/tez-mbeans-resource-calculator/src/test/resources>
[INFO] 
[INFO] --- maven-compiler-plugin:3.1:testCompile (default-testCompile) @ tez-mbeans-resource-calculator
---
[INFO] Changes detected - recompiling the module!
[INFO] Compiling 1 source file to <https://builds.apache.org/job/Tez-Build-Hadoop-2.2/ws/tez-plugins/tez-mbeans-resource-calculator/target/test-classes>
[INFO] 
[INFO] --- maven-surefire-plugin:2.14.1:test (default-test) @ tez-mbeans-resource-calculator
---
[INFO] Surefire report directory: <https://builds.apache.org/job/Tez-Build-Hadoop-2.2/ws/tez-plugins/tez-mbeans-resource-calculator/target/surefire-reports>

-------------------------------------------------------
 T E S T S
-------------------------------------------------------

-------------------------------------------------------
 T E S T S
-------------------------------------------------------
Running org.apache.tez.util.TestTezMxBeanResourceCalculator
Tests run: 1, Failures: 0, Errors: 0, Skipped: 0, Time elapsed: 0.379 sec

Results :

Tests run: 1, Failures: 0, Errors: 0, Skipped: 0

[INFO]                                                                         
[INFO] ------------------------------------------------------------------------
[INFO] Building tez-tools 0.8.0-SNAPSHOT
[INFO] ------------------------------------------------------------------------
[INFO] 
[INFO] --- maven-clean-plugin:2.5:clean (default-clean) @ tez-tools ---
[INFO] 
[INFO] --- buildnumber-maven-plugin:1.1:create (default) @ tez-tools ---
[INFO] Checking for local modifications: skipped.
[INFO] Updating project files from SCM: skipped.
[INFO] Executing: /bin/sh -c cd <https://builds.apache.org/job/Tez-Build-Hadoop-2.2/ws/tez-tools>
&& git rev-parse --verify HEAD
[INFO] Working directory: <https://builds.apache.org/job/Tez-Build-Hadoop-2.2/ws/tez-tools>
[INFO] Storing buildNumber: fa5ae1ac2b8240e00abedf995b29c43c7af993fd at timestamp: 1433462637491
[INFO] Executing: /bin/sh -c cd <https://builds.apache.org/job/Tez-Build-Hadoop-2.2/ws/tez-tools>
&& git rev-parse --verify HEAD
[INFO] Working directory: <https://builds.apache.org/job/Tez-Build-Hadoop-2.2/ws/tez-tools>
[INFO] Storing buildScmBranch: UNKNOWN
[INFO] 
[INFO] --- build-helper-maven-plugin:1.8:maven-version (maven-version) @ tez-tools ---
[INFO]                                                                         
[INFO] ------------------------------------------------------------------------
[INFO] Skipping tez-dist
[INFO] This project has been banned from the build due to previous failures.
[INFO] ------------------------------------------------------------------------
[INFO]                                                                         
[INFO] ------------------------------------------------------------------------
[INFO] Building Tez 0.8.0-SNAPSHOT
[INFO] ------------------------------------------------------------------------
[INFO] 
[INFO] --- maven-clean-plugin:2.5:clean (default-clean) @ tez-docs ---
[INFO] 
[INFO] --- buildnumber-maven-plugin:1.1:create (default) @ tez-docs ---
[INFO] Checking for local modifications: skipped.
[INFO] Updating project files from SCM: skipped.
[INFO] Executing: /bin/sh -c cd <https://builds.apache.org/job/Tez-Build-Hadoop-2.2/ws/docs>
&& git rev-parse --verify HEAD
[INFO] Working directory: <https://builds.apache.org/job/Tez-Build-Hadoop-2.2/ws/docs>
[INFO] Storing buildNumber: fa5ae1ac2b8240e00abedf995b29c43c7af993fd at timestamp: 1433462637506
[INFO] Executing: /bin/sh -c cd <https://builds.apache.org/job/Tez-Build-Hadoop-2.2/ws/docs>
&& git rev-parse --verify HEAD
[INFO] Working directory: <https://builds.apache.org/job/Tez-Build-Hadoop-2.2/ws/docs>
[INFO] Storing buildScmBranch: UNKNOWN
[INFO] 
[INFO] --- build-helper-maven-plugin:1.8:maven-version (maven-version) @ tez-docs ---
[INFO] ------------------------------------------------------------------------
[INFO] Reactor Summary:
[INFO] 
[INFO] tez ............................................... SUCCESS [  1.216 s]
[INFO] tez-api ........................................... SUCCESS [ 36.194 s]
[INFO] tez-common ........................................ SUCCESS [  3.297 s]
[INFO] tez-runtime-internals ............................. SUCCESS [ 11.140 s]
[INFO] tez-runtime-library ............................... SUCCESS [01:31 min]
[INFO] tez-mapreduce ..................................... SUCCESS [ 25.756 s]
[INFO] tez-examples ...................................... SUCCESS [  0.278 s]
[INFO] tez-dag ........................................... SUCCESS [02:02 min]
[INFO] tez-tests ......................................... FAILURE [27:38 min]
[INFO] tez-ui ............................................ SUCCESS [ 12.742 s]
[INFO] tez-plugins ....................................... SUCCESS [  0.014 s]
[INFO] tez-mbeans-resource-calculator .................... SUCCESS [  0.870 s]
[INFO] tez-tools ......................................... SUCCESS [  0.015 s]
[INFO] tez-dist .......................................... SKIPPED
[INFO] Tez ............................................... SUCCESS [  0.014 s]
[INFO] ------------------------------------------------------------------------
[INFO] BUILD FAILURE
[INFO] ------------------------------------------------------------------------
[INFO] Total time: 32:43 min
[INFO] Finished at: 2015-06-05T00:03:57+00:00
[INFO] Final Memory: 63M/785M
[INFO] ------------------------------------------------------------------------
[ERROR] Failed to execute goal org.apache.maven.plugins:maven-surefire-plugin:2.14.1:test
(default-test) on project tez-tests: There are test failures.
[ERROR] 
[ERROR] Please refer to <https://builds.apache.org/job/Tez-Build-Hadoop-2.2/ws/tez-tests/target/surefire-reports>
for the individual test results.
[ERROR] -> [Help 1]
[ERROR] 
[ERROR] To see the full stack trace of the errors, re-run Maven with the -e switch.
[ERROR] Re-run Maven using the -X switch to enable full debug logging.
[ERROR] 
[ERROR] For more information about the errors and possible solutions, please read the following
articles:
[ERROR] [Help 1] http://cwiki.apache.org/confluence/display/MAVEN/MojoFailureException
[ERROR] 
[ERROR] After correcting the problems, you can resume the build with the command
[ERROR]   mvn <goals> -rf :tez-tests
Build step 'Execute shell' marked build as failure
Recording test results

Mime
View raw message