tez-dev mailing list archives

Site index · List index
Message view « Date » · « Thread »
Top « Date » · « Thread »
From Apache Jenkins Server <jenk...@builds.apache.org>
Subject Build failed in Jenkins: Tez-Build-branch-0.7 #30
Date Wed, 17 Jun 2015 19:05:03 GMT
See <https://builds.apache.org/job/Tez-Build-branch-0.7/30/changes>

Changes:

[sseth] TEZ-2475. Fix a potential hang in Tez local mode caused by incorrectly

[sseth] Move TEZ-2475 to 0.5.4 release version in CHANGES.txt

[zjffdu] TEZ-2545. It is not necessary to start the vertex group commit when DAG is in TERMINATING
(zjffdu)

------------------------------------------
[...truncated 3215 lines...]
[INFO] --- maven-compiler-plugin:3.1:testCompile (default-testCompile) @ tez-ui ---
[INFO] No sources to compile
[INFO] 
[INFO] --- maven-surefire-plugin:2.14.1:test (default-test) @ tez-ui ---
[INFO] Tests are skipped.
[INFO] 
[INFO] --- maven-war-plugin:2.5:war (default-war) @ tez-ui ---
[INFO] Packaging webapp
[INFO] Assembling webapp [tez-ui] in [<https://builds.apache.org/job/Tez-Build-branch-0.7/ws/tez-ui/target/tez-ui-0.7.1-SNAPSHOT]>
[INFO] Processing war project
[INFO] Copying webapp webResources [<https://builds.apache.org/job/Tez-Build-branch-0.7/ws/tez-ui/src/main/resources/]>
to [<https://builds.apache.org/job/Tez-Build-branch-0.7/ws/tez-ui/target/tez-ui-0.7.1-SNAPSHOT]>
[INFO] Copying webapp webResources [<https://builds.apache.org/job/Tez-Build-branch-0.7/ws/tez-ui/src/main/webapp/dist]>
to [<https://builds.apache.org/job/Tez-Build-branch-0.7/ws/tez-ui/target/tez-ui-0.7.1-SNAPSHOT]>
[INFO] Copying webapp webResources [<https://builds.apache.org/job/Tez-Build-branch-0.7/ws/tez-ui/src/main/webapp/dist]>
to [<https://builds.apache.org/job/Tez-Build-branch-0.7/ws/tez-ui/target/tez-ui-0.7.1-SNAPSHOT]>
[INFO] Copying webapp resources [<https://builds.apache.org/job/Tez-Build-branch-0.7/ws/tez-ui/src/main/webapp/dist]>
[INFO] Webapp assembled in [33 msecs]
[INFO] Building war: <https://builds.apache.org/job/Tez-Build-branch-0.7/ws/tez-ui/target/tez-ui-0.7.1-SNAPSHOT.war>
[INFO] 
[INFO] --- maven-jar-plugin:2.4:test-jar (default) @ tez-ui ---
[WARNING] JAR will be empty - no content was marked for inclusion!
[INFO] Building jar: <https://builds.apache.org/job/Tez-Build-branch-0.7/ws/tez-ui/target/tez-ui-0.7.1-SNAPSHOT-tests.jar>
[INFO]                                                                         
[INFO] ------------------------------------------------------------------------
[INFO] Building tez-plugins 0.7.1-SNAPSHOT
[INFO] ------------------------------------------------------------------------
[INFO] 
[INFO] --- maven-clean-plugin:2.5:clean (default-clean) @ tez-plugins ---
[INFO] 
[INFO] --- buildnumber-maven-plugin:1.1:create (default) @ tez-plugins ---
[INFO] Checking for local modifications: skipped.
[INFO] Updating project files from SCM: skipped.
[INFO] Executing: /bin/sh -c cd <https://builds.apache.org/job/Tez-Build-branch-0.7/ws/tez-plugins>
&& git rev-parse --verify HEAD
[INFO] Working directory: <https://builds.apache.org/job/Tez-Build-branch-0.7/ws/tez-plugins>
[INFO] Storing buildNumber: 411c9ed6670f298417df91d1fd7ad6b48e25c4ad at timestamp: 1434567902177
[INFO] Executing: /bin/sh -c cd <https://builds.apache.org/job/Tez-Build-branch-0.7/ws/tez-plugins>
&& git rev-parse --verify HEAD
[INFO] Working directory: <https://builds.apache.org/job/Tez-Build-branch-0.7/ws/tez-plugins>
[INFO] Storing buildScmBranch: UNKNOWN
[INFO] 
[INFO] --- build-helper-maven-plugin:1.8:maven-version (maven-version) @ tez-plugins ---
[INFO] 
[INFO] --- buildnumber-maven-plugin:1.1:create (default) @ tez-plugins ---
[INFO] Checking for local modifications: skipped.
[INFO] Updating project files from SCM: skipped.
[INFO] Executing: /bin/sh -c cd <https://builds.apache.org/job/Tez-Build-branch-0.7/ws/tez-plugins>
&& git rev-parse --verify HEAD
[INFO] Working directory: <https://builds.apache.org/job/Tez-Build-branch-0.7/ws/tez-plugins>
[INFO] Storing buildNumber: 411c9ed6670f298417df91d1fd7ad6b48e25c4ad at timestamp: 1434567902188
[INFO] Executing: /bin/sh -c cd <https://builds.apache.org/job/Tez-Build-branch-0.7/ws/tez-plugins>
&& git rev-parse --verify HEAD
[INFO] Working directory: <https://builds.apache.org/job/Tez-Build-branch-0.7/ws/tez-plugins>
[INFO] Storing buildScmBranch: UNKNOWN
[INFO] 
[INFO] --- build-helper-maven-plugin:1.8:maven-version (maven-version) @ tez-plugins ---
[INFO] 
[INFO] --- maven-jar-plugin:2.4:test-jar (default) @ tez-plugins ---
[WARNING] JAR will be empty - no content was marked for inclusion!
[INFO] Building jar: <https://builds.apache.org/job/Tez-Build-branch-0.7/ws/tez-plugins/target/tez-plugins-0.7.1-SNAPSHOT-tests.jar>
[INFO] 
[INFO] --- maven-install-plugin:2.4:install (default-install) @ tez-plugins ---
[INFO] Installing <https://builds.apache.org/job/Tez-Build-branch-0.7/ws/tez-plugins/pom.xml>
to /home/jenkins/.m2/repository/org/apache/tez/tez-plugins/0.7.1-SNAPSHOT/tez-plugins-0.7.1-SNAPSHOT.pom
[INFO] Installing <https://builds.apache.org/job/Tez-Build-branch-0.7/ws/tez-plugins/target/tez-plugins-0.7.1-SNAPSHOT-tests.jar>
to /home/jenkins/.m2/repository/org/apache/tez/tez-plugins/0.7.1-SNAPSHOT/tez-plugins-0.7.1-SNAPSHOT-tests.jar
[INFO] 
[INFO] --- maven-deploy-plugin:2.8.1:deploy (default-deploy) @ tez-plugins ---
[INFO] Deploying org.apache.tez:tez-plugins:0.7.1-SNAPSHOT at end
[INFO] 
[INFO] --- buildnumber-maven-plugin:1.1:create (default) @ tez-plugins ---
[INFO] Checking for local modifications: skipped.
[INFO] Updating project files from SCM: skipped.
[INFO] Executing: /bin/sh -c cd <https://builds.apache.org/job/Tez-Build-branch-0.7/ws/tez-plugins>
&& git rev-parse --verify HEAD
[INFO] Working directory: <https://builds.apache.org/job/Tez-Build-branch-0.7/ws/tez-plugins>
[INFO] Storing buildNumber: 411c9ed6670f298417df91d1fd7ad6b48e25c4ad at timestamp: 1434567902228
[INFO] Executing: /bin/sh -c cd <https://builds.apache.org/job/Tez-Build-branch-0.7/ws/tez-plugins>
&& git rev-parse --verify HEAD
[INFO] Working directory: <https://builds.apache.org/job/Tez-Build-branch-0.7/ws/tez-plugins>
[INFO] Storing buildScmBranch: UNKNOWN
[INFO] 
[INFO] --- build-helper-maven-plugin:1.8:maven-version (maven-version) @ tez-plugins ---
[INFO] 
[INFO] --- maven-jar-plugin:2.4:test-jar (default) @ tez-plugins ---
[WARNING] JAR will be empty - no content was marked for inclusion!
[INFO]                                                                         
[INFO] ------------------------------------------------------------------------
[INFO] Skipping tez-yarn-timeline-history
[INFO] This project has been banned from the build due to previous failures.
[INFO] ------------------------------------------------------------------------
[INFO]                                                                         
[INFO] ------------------------------------------------------------------------
[INFO] Skipping tez-yarn-timeline-history-with-acls
[INFO] This project has been banned from the build due to previous failures.
[INFO] ------------------------------------------------------------------------
[INFO]                                                                         
[INFO] ------------------------------------------------------------------------
[INFO] Skipping tez-mbeans-resource-calculator
[INFO] This project has been banned from the build due to previous failures.
[INFO] ------------------------------------------------------------------------
[INFO]                                                                         
[INFO] ------------------------------------------------------------------------
[INFO] Building tez-tools 0.7.1-SNAPSHOT
[INFO] ------------------------------------------------------------------------
[INFO] 
[INFO] --- maven-clean-plugin:2.5:clean (default-clean) @ tez-tools ---
[INFO] 
[INFO] --- buildnumber-maven-plugin:1.1:create (default) @ tez-tools ---
[INFO] Checking for local modifications: skipped.
[INFO] Updating project files from SCM: skipped.
[INFO] Executing: /bin/sh -c cd <https://builds.apache.org/job/Tez-Build-branch-0.7/ws/tez-tools>
&& git rev-parse --verify HEAD
[INFO] Working directory: <https://builds.apache.org/job/Tez-Build-branch-0.7/ws/tez-tools>
[INFO] Storing buildNumber: 411c9ed6670f298417df91d1fd7ad6b48e25c4ad at timestamp: 1434567902258
[INFO] Executing: /bin/sh -c cd <https://builds.apache.org/job/Tez-Build-branch-0.7/ws/tez-tools>
&& git rev-parse --verify HEAD
[INFO] Working directory: <https://builds.apache.org/job/Tez-Build-branch-0.7/ws/tez-tools>
[INFO] Storing buildScmBranch: UNKNOWN
[INFO] 
[INFO] --- build-helper-maven-plugin:1.8:maven-version (maven-version) @ tez-tools ---
[INFO] 
[INFO] --- buildnumber-maven-plugin:1.1:create (default) @ tez-tools ---
[INFO] Checking for local modifications: skipped.
[INFO] Updating project files from SCM: skipped.
[INFO] Executing: /bin/sh -c cd <https://builds.apache.org/job/Tez-Build-branch-0.7/ws/tez-tools>
&& git rev-parse --verify HEAD
[INFO] Working directory: <https://builds.apache.org/job/Tez-Build-branch-0.7/ws/tez-tools>
[INFO] Storing buildNumber: 411c9ed6670f298417df91d1fd7ad6b48e25c4ad at timestamp: 1434567902269
[INFO] Executing: /bin/sh -c cd <https://builds.apache.org/job/Tez-Build-branch-0.7/ws/tez-tools>
&& git rev-parse --verify HEAD
[INFO] Working directory: <https://builds.apache.org/job/Tez-Build-branch-0.7/ws/tez-tools>
[INFO] Storing buildScmBranch: UNKNOWN
[INFO] 
[INFO] --- build-helper-maven-plugin:1.8:maven-version (maven-version) @ tez-tools ---
[INFO] 
[INFO] --- maven-jar-plugin:2.4:test-jar (default) @ tez-tools ---
[WARNING] JAR will be empty - no content was marked for inclusion!
[INFO] Building jar: <https://builds.apache.org/job/Tez-Build-branch-0.7/ws/tez-tools/target/tez-tools-0.7.1-SNAPSHOT-tests.jar>
[INFO] 
[INFO] --- maven-install-plugin:2.4:install (default-install) @ tez-tools ---
[INFO] Installing <https://builds.apache.org/job/Tez-Build-branch-0.7/ws/tez-tools/pom.xml>
to /home/jenkins/.m2/repository/org/apache/tez/tez-tools/0.7.1-SNAPSHOT/tez-tools-0.7.1-SNAPSHOT.pom
[INFO] Installing <https://builds.apache.org/job/Tez-Build-branch-0.7/ws/tez-tools/target/tez-tools-0.7.1-SNAPSHOT-tests.jar>
to /home/jenkins/.m2/repository/org/apache/tez/tez-tools/0.7.1-SNAPSHOT/tez-tools-0.7.1-SNAPSHOT-tests.jar
[INFO] 
[INFO] --- maven-deploy-plugin:2.8.1:deploy (default-deploy) @ tez-tools ---
[INFO] Deploying org.apache.tez:tez-tools:0.7.1-SNAPSHOT at end
[INFO] 
[INFO] --- buildnumber-maven-plugin:1.1:create (default) @ tez-tools ---
[INFO] Checking for local modifications: skipped.
[INFO] Updating project files from SCM: skipped.
[INFO] Executing: /bin/sh -c cd <https://builds.apache.org/job/Tez-Build-branch-0.7/ws/tez-tools>
&& git rev-parse --verify HEAD
[INFO] Working directory: <https://builds.apache.org/job/Tez-Build-branch-0.7/ws/tez-tools>
[INFO] Storing buildNumber: 411c9ed6670f298417df91d1fd7ad6b48e25c4ad at timestamp: 1434567902306
[INFO] Executing: /bin/sh -c cd <https://builds.apache.org/job/Tez-Build-branch-0.7/ws/tez-tools>
&& git rev-parse --verify HEAD
[INFO] Working directory: <https://builds.apache.org/job/Tez-Build-branch-0.7/ws/tez-tools>
[INFO] Storing buildScmBranch: UNKNOWN
[INFO] 
[INFO] --- build-helper-maven-plugin:1.8:maven-version (maven-version) @ tez-tools ---
[INFO] 
[INFO] --- maven-jar-plugin:2.4:test-jar (default) @ tez-tools ---
[WARNING] JAR will be empty - no content was marked for inclusion!
[INFO]                                                                         
[INFO] ------------------------------------------------------------------------
[INFO] Skipping tez-dist
[INFO] This project has been banned from the build due to previous failures.
[INFO] ------------------------------------------------------------------------
[INFO]                                                                         
[INFO] ------------------------------------------------------------------------
[INFO] Building Tez 0.7.1-SNAPSHOT
[INFO] ------------------------------------------------------------------------
[INFO] 
[INFO] --- maven-clean-plugin:2.5:clean (default-clean) @ tez-docs ---
[INFO] 
[INFO] --- buildnumber-maven-plugin:1.1:create (default) @ tez-docs ---
[INFO] Checking for local modifications: skipped.
[INFO] Updating project files from SCM: skipped.
[INFO] Executing: /bin/sh -c cd <https://builds.apache.org/job/Tez-Build-branch-0.7/ws/docs>
&& git rev-parse --verify HEAD
[INFO] Working directory: <https://builds.apache.org/job/Tez-Build-branch-0.7/ws/docs>
[INFO] Storing buildNumber: 411c9ed6670f298417df91d1fd7ad6b48e25c4ad at timestamp: 1434567902335
[INFO] Executing: /bin/sh -c cd <https://builds.apache.org/job/Tez-Build-branch-0.7/ws/docs>
&& git rev-parse --verify HEAD
[INFO] Working directory: <https://builds.apache.org/job/Tez-Build-branch-0.7/ws/docs>
[INFO] Storing buildScmBranch: UNKNOWN
[INFO] 
[INFO] --- build-helper-maven-plugin:1.8:maven-version (maven-version) @ tez-docs ---
[INFO] 
[INFO] --- buildnumber-maven-plugin:1.1:create (default) @ tez-docs ---
[INFO] Checking for local modifications: skipped.
[INFO] Updating project files from SCM: skipped.
[INFO] Executing: /bin/sh -c cd <https://builds.apache.org/job/Tez-Build-branch-0.7/ws/docs>
&& git rev-parse --verify HEAD
[INFO] Working directory: <https://builds.apache.org/job/Tez-Build-branch-0.7/ws/docs>
[INFO] Storing buildNumber: 411c9ed6670f298417df91d1fd7ad6b48e25c4ad at timestamp: 1434567902344
[INFO] Executing: /bin/sh -c cd <https://builds.apache.org/job/Tez-Build-branch-0.7/ws/docs>
&& git rev-parse --verify HEAD
[INFO] Working directory: <https://builds.apache.org/job/Tez-Build-branch-0.7/ws/docs>
[INFO] Storing buildScmBranch: UNKNOWN
[INFO] 
[INFO] --- build-helper-maven-plugin:1.8:maven-version (maven-version) @ tez-docs ---
[INFO] 
[INFO] --- maven-jar-plugin:2.4:test-jar (default) @ tez-docs ---
[WARNING] JAR will be empty - no content was marked for inclusion!
[INFO] Building jar: <https://builds.apache.org/job/Tez-Build-branch-0.7/ws/docs/target/tez-docs-0.7.1-SNAPSHOT-tests.jar>
[INFO] 
[INFO] --- maven-install-plugin:2.4:install (default-install) @ tez-docs ---
[INFO] Installing <https://builds.apache.org/job/Tez-Build-branch-0.7/ws/docs/pom.xml>
to /home/jenkins/.m2/repository/org/apache/tez/tez-docs/0.7.1-SNAPSHOT/tez-docs-0.7.1-SNAPSHOT.pom
[INFO] Installing <https://builds.apache.org/job/Tez-Build-branch-0.7/ws/docs/target/tez-docs-0.7.1-SNAPSHOT-tests.jar>
to /home/jenkins/.m2/repository/org/apache/tez/tez-docs/0.7.1-SNAPSHOT/tez-docs-0.7.1-SNAPSHOT-tests.jar
[INFO] 
[INFO] --- maven-deploy-plugin:2.8.1:deploy (default-deploy) @ tez-docs ---
[INFO] Skipping artifact deployment
[INFO] 
[INFO] --- buildnumber-maven-plugin:1.1:create (default) @ tez-docs ---
[INFO] Checking for local modifications: skipped.
[INFO] Updating project files from SCM: skipped.
[INFO] Executing: /bin/sh -c cd <https://builds.apache.org/job/Tez-Build-branch-0.7/ws/docs>
&& git rev-parse --verify HEAD
[INFO] Working directory: <https://builds.apache.org/job/Tez-Build-branch-0.7/ws/docs>
[INFO] Storing buildNumber: 411c9ed6670f298417df91d1fd7ad6b48e25c4ad at timestamp: 1434567902381
[INFO] Executing: /bin/sh -c cd <https://builds.apache.org/job/Tez-Build-branch-0.7/ws/docs>
&& git rev-parse --verify HEAD
[INFO] Working directory: <https://builds.apache.org/job/Tez-Build-branch-0.7/ws/docs>
[INFO] Storing buildScmBranch: UNKNOWN
[INFO] 
[INFO] --- build-helper-maven-plugin:1.8:maven-version (maven-version) @ tez-docs ---
[INFO] 
[INFO] --- maven-jar-plugin:2.4:test-jar (default) @ tez-docs ---
[WARNING] JAR will be empty - no content was marked for inclusion!
[INFO] ------------------------------------------------------------------------
[INFO] Reactor Summary:
[INFO] 
[INFO] tez ............................................... SUCCESS [  1.260 s]
[INFO] tez-api ........................................... SUCCESS [ 17.420 s]
[INFO] tez-common ........................................ SUCCESS [  0.623 s]
[INFO] tez-runtime-internals ............................. SUCCESS [  0.861 s]
[INFO] tez-runtime-library ............................... SUCCESS [  3.432 s]
[INFO] tez-mapreduce ..................................... SUCCESS [  1.169 s]
[INFO] tez-examples ...................................... SUCCESS [  0.358 s]
[INFO] tez-dag ........................................... FAILURE [  2.294 s]
[INFO] tez-tests ......................................... SKIPPED
[INFO] tez-ui ............................................ SUCCESS [01:30 min]
[INFO] tez-plugins ....................................... SUCCESS [  0.084 s]
[INFO] tez-yarn-timeline-history ......................... SKIPPED
[INFO] tez-yarn-timeline-history-with-acls ............... SKIPPED
[INFO] tez-mbeans-resource-calculator .................... SKIPPED
[INFO] tez-tools ......................................... SUCCESS [  0.077 s]
[INFO] tez-dist .......................................... SKIPPED
[INFO] Tez ............................................... SUCCESS [  0.087 s]
[INFO] ------------------------------------------------------------------------
[INFO] BUILD FAILURE
[INFO] ------------------------------------------------------------------------
[INFO] Total time: 01:59 min
[INFO] Finished at: 2015-06-17T19:05:02+00:00
[INFO] Final Memory: 61M/1053M
[INFO] ------------------------------------------------------------------------
[ERROR] Failed to execute goal org.apache.maven.plugins:maven-compiler-plugin:3.1:compile
(default-compile) on project tez-dag: Compilation failure
[ERROR] <https://builds.apache.org/job/Tez-Build-branch-0.7/ws/tez-dag/src/main/java/org/apache/tez/dag/app/launcher/LocalContainerLauncher.java>:[190,11]
unreported exception java.lang.Throwable; must be caught or declared to be thrown
[ERROR] -> [Help 1]
[ERROR] 
[ERROR] To see the full stack trace of the errors, re-run Maven with the -e switch.
[ERROR] Re-run Maven using the -X switch to enable full debug logging.
[ERROR] 
[ERROR] For more information about the errors and possible solutions, please read the following
articles:
[ERROR] [Help 1] http://cwiki.apache.org/confluence/display/MAVEN/MojoFailureException
[ERROR] 
[ERROR] After correcting the problems, you can resume the build with the command
[ERROR]   mvn <goals> -rf :tez-dag
Build step 'Execute shell' marked build as failure
Archiving artifacts

Mime
View raw message