tez-dev mailing list archives

Site index · List index
Message view « Date » · « Thread »
Top « Date » · « Thread »
From Apache Jenkins Server <jenk...@builds.apache.org>
Subject Build failed in Jenkins: Tez-Build-branch-0.7 #29
Date Tue, 16 Jun 2015 16:51:06 GMT
See <https://builds.apache.org/job/Tez-Build-branch-0.7/29/changes>

Changes:

[pramachandran] TEZ-2554. Tez UI: View log link does not correctly propagate login crendential
to read log from yarn web. (sree via prakash)

------------------------------------------
[...truncated 2635 lines...]
[WARNING] The following patterns were never triggered in this artifact exclusion filter:
o  '*:*:test-jar'

[WARNING] The following patterns were never triggered in this artifact exclusion filter:
o  '*:*:test-jar'

[WARNING] The following patterns were never triggered in this artifact exclusion filter:
o  '*:*:test-jar'

[WARNING] The following patterns were never triggered in this artifact exclusion filter:
o  '*:*:test-jar'

[INFO] Building tar: <https://builds.apache.org/job/Tez-Build-branch-0.7/29/artifact/tez-dist/target/tez-0.7.1-SNAPSHOT-minimal.tar.gz>
[INFO] 
[INFO] --- maven-jar-plugin:2.4:test-jar (default) @ tez-dist ---
[WARNING] JAR will be empty - no content was marked for inclusion!
[INFO] Building jar: <https://builds.apache.org/job/Tez-Build-branch-0.7/ws/tez-dist/target/tez-dist-0.7.1-SNAPSHOT-tests.jar>
[INFO] 
[INFO] --- maven-install-plugin:2.4:install (default-install) @ tez-dist ---
[INFO] Installing <https://builds.apache.org/job/Tez-Build-branch-0.7/ws/tez-dist/pom.xml>
to /home/jenkins/.m2/repository/org/apache/tez/tez-dist/0.7.1-SNAPSHOT/tez-dist-0.7.1-SNAPSHOT.pom
[INFO] Installing <https://builds.apache.org/job/Tez-Build-branch-0.7/ws/tez-dist/target/tez-dist-0.7.1-SNAPSHOT-tests.jar>
to /home/jenkins/.m2/repository/org/apache/tez/tez-dist/0.7.1-SNAPSHOT/tez-dist-0.7.1-SNAPSHOT-tests.jar
[INFO] 
[INFO] --- maven-deploy-plugin:2.8.1:deploy (default-deploy) @ tez-dist ---
[INFO] Skipping artifact deployment
[INFO] 
[INFO] --- buildnumber-maven-plugin:1.1:create (default) @ tez-dist ---
[INFO] Checking for local modifications: skipped.
[INFO] Updating project files from SCM: skipped.
[INFO] Executing: /bin/sh -c cd <https://builds.apache.org/job/Tez-Build-branch-0.7/ws/tez-dist>
&& git rev-parse --verify HEAD
[INFO] Working directory: <https://builds.apache.org/job/Tez-Build-branch-0.7/ws/tez-dist>
[INFO] Storing buildNumber: f3619dc5298589590f95f3c9b29ed88b6a3eecf5 at timestamp: 1434473415702
[INFO] Executing: /bin/sh -c cd <https://builds.apache.org/job/Tez-Build-branch-0.7/ws/tez-dist>
&& git rev-parse --verify HEAD
[INFO] Working directory: <https://builds.apache.org/job/Tez-Build-branch-0.7/ws/tez-dist>
[INFO] Storing buildScmBranch: UNKNOWN
[INFO] 
[INFO] --- build-helper-maven-plugin:1.8:maven-version (maven-version) @ tez-dist ---
[INFO] 
[INFO] --- maven-assembly-plugin:2.4:single (package-tez) @ tez-dist ---
[INFO] Reading assembly descriptor: src/main/assembly/tez-dist.xml
[WARNING] NOTE: Currently, inclusion of module dependencies may produce unpredictable results
if a version conflict occurs.
[WARNING] The following patterns were never triggered in this artifact exclusion filter:
o  '*:*:test-jar'

[WARNING] The following patterns were never triggered in this artifact exclusion filter:
o  '*:*:test-jar'

[WARNING] The following patterns were never triggered in this artifact exclusion filter:
o  '*:*:test-jar'

[WARNING] The following patterns were never triggered in this artifact exclusion filter:
o  '*:*:test-jar'

[WARNING] The following patterns were never triggered in this artifact exclusion filter:
o  '*:*:test-jar'

[WARNING] The following patterns were never triggered in this artifact exclusion filter:
o  '*:*:test-jar'

[WARNING] The following patterns were never triggered in this artifact exclusion filter:
o  '*:*:test-jar'

[WARNING] The following patterns were never triggered in this artifact exclusion filter:
o  '*:*:test-jar'

[WARNING] The following patterns were never triggered in this artifact exclusion filter:
o  '*:*:test-jar'

[WARNING] The following patterns were never triggered in this artifact exclusion filter:
o  '*:*:test-jar'

[WARNING] The following patterns were never triggered in this artifact exclusion filter:
o  '*:*:test-jar'

[WARNING] The following patterns were never triggered in this artifact exclusion filter:
o  '*:*:test-jar'

[INFO] Copying files to <https://builds.apache.org/job/Tez-Build-branch-0.7/ws/tez-dist/target/tez-0.7.1-SNAPSHOT>
[WARNING] NOTE: Currently, inclusion of module dependencies may produce unpredictable results
if a version conflict occurs.
[WARNING] The following patterns were never triggered in this artifact exclusion filter:
o  '*:*:test-jar'

[WARNING] The following patterns were never triggered in this artifact exclusion filter:
o  '*:*:test-jar'

[WARNING] The following patterns were never triggered in this artifact exclusion filter:
o  '*:*:test-jar'

[WARNING] The following patterns were never triggered in this artifact exclusion filter:
o  '*:*:test-jar'

[WARNING] The following patterns were never triggered in this artifact exclusion filter:
o  '*:*:test-jar'

[WARNING] The following patterns were never triggered in this artifact exclusion filter:
o  '*:*:test-jar'

[WARNING] The following patterns were never triggered in this artifact exclusion filter:
o  '*:*:test-jar'

[WARNING] The following patterns were never triggered in this artifact exclusion filter:
o  '*:*:test-jar'

[WARNING] The following patterns were never triggered in this artifact exclusion filter:
o  '*:*:test-jar'

[WARNING] The following patterns were never triggered in this artifact exclusion filter:
o  '*:*:test-jar'

[WARNING] The following patterns were never triggered in this artifact exclusion filter:
o  '*:*:test-jar'

[WARNING] The following patterns were never triggered in this artifact exclusion filter:
o  '*:*:test-jar'

[INFO] Building tar: <https://builds.apache.org/job/Tez-Build-branch-0.7/29/artifact/tez-dist/target/tez-0.7.1-SNAPSHOT.tar.gz>
[INFO] 
[INFO] --- maven-assembly-plugin:2.4:single (package-tez-minimal) @ tez-dist ---
[INFO] Reading assembly descriptor: src/main/assembly/tez-dist-minimal.xml
[WARNING] NOTE: Currently, inclusion of module dependencies may produce unpredictable results
if a version conflict occurs.
[WARNING] The following patterns were never triggered in this artifact exclusion filter:
o  '*:*:test-jar'

[WARNING] The following patterns were never triggered in this artifact exclusion filter:
o  '*:*:test-jar'

[WARNING] The following patterns were never triggered in this artifact exclusion filter:
o  '*:*:test-jar'

[WARNING] The following patterns were never triggered in this artifact exclusion filter:
o  '*:*:test-jar'

[WARNING] The following patterns were never triggered in this artifact exclusion filter:
o  '*:*:test-jar'

[WARNING] The following patterns were never triggered in this artifact exclusion filter:
o  '*:*:test-jar'

[WARNING] The following patterns were never triggered in this artifact exclusion filter:
o  '*:*:test-jar'

[WARNING] The following patterns were never triggered in this artifact exclusion filter:
o  '*:*:test-jar'

[WARNING] The following patterns were never triggered in this artifact exclusion filter:
o  '*:*:test-jar'

[WARNING] The following patterns were never triggered in this artifact exclusion filter:
o  '*:*:test-jar'

[WARNING] The following patterns were never triggered in this artifact exclusion filter:
o  '*:*:test-jar'

[WARNING] The following patterns were never triggered in this artifact exclusion filter:
o  '*:*:test-jar'

[INFO] Building tar: <https://builds.apache.org/job/Tez-Build-branch-0.7/29/artifact/tez-dist/target/tez-0.7.1-SNAPSHOT-minimal.tar.gz>
[INFO] 
[INFO] --- maven-jar-plugin:2.4:test-jar (default) @ tez-dist ---
[WARNING] JAR will be empty - no content was marked for inclusion!
[INFO]                                                                         
[INFO] ------------------------------------------------------------------------
[INFO] Building Tez 0.7.1-SNAPSHOT
[INFO] ------------------------------------------------------------------------
[INFO] 
[INFO] --- maven-clean-plugin:2.5:clean (default-clean) @ tez-docs ---
[INFO] Deleting <https://builds.apache.org/job/Tez-Build-branch-0.7/ws/docs/target>
[INFO] 
[INFO] --- buildnumber-maven-plugin:1.1:create (default) @ tez-docs ---
[INFO] Checking for local modifications: skipped.
[INFO] Updating project files from SCM: skipped.
[INFO] Executing: /bin/sh -c cd <https://builds.apache.org/job/Tez-Build-branch-0.7/ws/docs>
&& git rev-parse --verify HEAD
[INFO] Working directory: <https://builds.apache.org/job/Tez-Build-branch-0.7/ws/docs>
[INFO] Storing buildNumber: f3619dc5298589590f95f3c9b29ed88b6a3eecf5 at timestamp: 1434473441190
[INFO] Executing: /bin/sh -c cd <https://builds.apache.org/job/Tez-Build-branch-0.7/ws/docs>
&& git rev-parse --verify HEAD
[INFO] Working directory: <https://builds.apache.org/job/Tez-Build-branch-0.7/ws/docs>
[INFO] Storing buildScmBranch: UNKNOWN
[INFO] 
[INFO] --- build-helper-maven-plugin:1.8:maven-version (maven-version) @ tez-docs ---
[INFO] 
[INFO] --- buildnumber-maven-plugin:1.1:create (default) @ tez-docs ---
[INFO] Checking for local modifications: skipped.
[INFO] Updating project files from SCM: skipped.
[INFO] Executing: /bin/sh -c cd <https://builds.apache.org/job/Tez-Build-branch-0.7/ws/docs>
&& git rev-parse --verify HEAD
[INFO] Working directory: <https://builds.apache.org/job/Tez-Build-branch-0.7/ws/docs>
[INFO] Storing buildNumber: f3619dc5298589590f95f3c9b29ed88b6a3eecf5 at timestamp: 1434473441201
[INFO] Executing: /bin/sh -c cd <https://builds.apache.org/job/Tez-Build-branch-0.7/ws/docs>
&& git rev-parse --verify HEAD
[INFO] Working directory: <https://builds.apache.org/job/Tez-Build-branch-0.7/ws/docs>
[INFO] Storing buildScmBranch: UNKNOWN
[INFO] 
[INFO] --- build-helper-maven-plugin:1.8:maven-version (maven-version) @ tez-docs ---
[INFO] 
[INFO] --- maven-jar-plugin:2.4:test-jar (default) @ tez-docs ---
[WARNING] JAR will be empty - no content was marked for inclusion!
[INFO] Building jar: <https://builds.apache.org/job/Tez-Build-branch-0.7/ws/docs/target/tez-docs-0.7.1-SNAPSHOT-tests.jar>
[INFO] 
[INFO] --- maven-install-plugin:2.4:install (default-install) @ tez-docs ---
[INFO] Installing <https://builds.apache.org/job/Tez-Build-branch-0.7/ws/docs/pom.xml>
to /home/jenkins/.m2/repository/org/apache/tez/tez-docs/0.7.1-SNAPSHOT/tez-docs-0.7.1-SNAPSHOT.pom
[INFO] Installing <https://builds.apache.org/job/Tez-Build-branch-0.7/ws/docs/target/tez-docs-0.7.1-SNAPSHOT-tests.jar>
to /home/jenkins/.m2/repository/org/apache/tez/tez-docs/0.7.1-SNAPSHOT/tez-docs-0.7.1-SNAPSHOT-tests.jar
[INFO] 
[INFO] --- maven-deploy-plugin:2.8.1:deploy (default-deploy) @ tez-docs ---
[INFO] Skipping artifact deployment
Downloading: https://repository.apache.org/content/repositories/snapshots/org/apache/tez/tez/0.7.1-SNAPSHOT/maven-metadata.xml

[WARNING] Could not transfer metadata org.apache.tez:tez:0.7.1-SNAPSHOT/maven-metadata.xml
from/to apache.snapshots.https (https://repository.apache.org/content/repositories/snapshots):
java.lang.RuntimeException: Could not generate DH keypair
[INFO] ------------------------------------------------------------------------
[INFO] Reactor Summary:
[INFO] 
[INFO] tez ............................................... SUCCESS [  1.305 s]
[INFO] tez-api ........................................... SUCCESS [ 18.785 s]
[INFO] tez-common ........................................ SUCCESS [  0.825 s]
[INFO] tez-runtime-internals ............................. SUCCESS [  1.055 s]
[INFO] tez-runtime-library ............................... SUCCESS [  3.391 s]
[INFO] tez-mapreduce ..................................... SUCCESS [  1.810 s]
[INFO] tez-examples ...................................... SUCCESS [  0.452 s]
[INFO] tez-dag ........................................... SUCCESS [  8.666 s]
[INFO] tez-tests ......................................... SUCCESS [  0.884 s]
[INFO] tez-ui ............................................ SUCCESS [ 42.403 s]
[INFO] tez-plugins ....................................... SUCCESS [  0.123 s]
[INFO] tez-yarn-timeline-history ......................... SUCCESS [  0.792 s]
[INFO] tez-yarn-timeline-history-with-acls ............... SUCCESS [  0.530 s]
[INFO] tez-mbeans-resource-calculator .................... SUCCESS [  0.344 s]
[INFO] tez-tools ......................................... SUCCESS [  0.101 s]
[INFO] tez-dist .......................................... SUCCESS [ 53.966 s]
[INFO] Tez ............................................... FAILURE [  1.245 s]
[INFO] ------------------------------------------------------------------------
[INFO] BUILD FAILURE
[INFO] ------------------------------------------------------------------------
[INFO] Total time: 02:17 min
[INFO] Finished at: 2015-06-16T16:50:42+00:00
[INFO] Final Memory: 68M/1184M
[INFO] ------------------------------------------------------------------------
[ERROR] Failed to execute goal org.apache.maven.plugins:maven-deploy-plugin:2.8.1:deploy (default-deploy)
on project tez-docs: Failed to retrieve remote metadata org.apache.tez:tez:0.7.1-SNAPSHOT/maven-metadata.xml:
Could not transfer metadata org.apache.tez:tez:0.7.1-SNAPSHOT/maven-metadata.xml from/to apache.snapshots.https
(https://repository.apache.org/content/repositories/snapshots): java.lang.RuntimeException:
Could not generate DH keypair: Prime size must be multiple of 64, and can only range from
512 to 1024 (inclusive) -> [Help 1]
[ERROR] 
[ERROR] To see the full stack trace of the errors, re-run Maven with the -e switch.
[ERROR] Re-run Maven using the -X switch to enable full debug logging.
[ERROR] 
[ERROR] For more information about the errors and possible solutions, please read the following
articles:
[ERROR] [Help 1] http://cwiki.apache.org/confluence/display/MAVEN/MojoExecutionException
[ERROR] 
[ERROR] After correcting the problems, you can resume the build with the command
[ERROR]   mvn <goals> -rf :tez-docs
Build step 'Execute shell' marked build as failure
Archiving artifacts
Sending artifact delta relative to Tez-Build-branch-0.7 #24
Archived 2 artifacts
Archive block size is 32768
Received 0 blocks and 51833224 bytes
Compression is 0.0%
Took 23 sec

Mime
View raw message