tez-dev mailing list archives

Site index · List index
Message view « Date » · « Thread »
Top « Date » · « Thread »
From Apache Jenkins Server <jenk...@builds.apache.org>
Subject Build failed in Jenkins: Tez-Build-Hadoop-2.4 #150
Date Wed, 12 Aug 2015 04:09:40 GMT
See <https://builds.apache.org/job/Tez-Build-Hadoop-2.4/150/changes>

Changes:

[rbalamohan] TEZ-2692. bugfixes & enhancements related to job parser and analyzer (rbalamohan)

------------------------------------------
[...truncated 1053 lines...]
Running "neuter:app" (neuter) task

Running "less:production" (less) task
File .tmp/styles/styles.css created: 383.96 kB → 314.61 kB

Running "concat:dist/styles/main.css" (concat) task
File "dist/styles/main.css" created.

Running "concat:dist/scripts/components.js" (concat) task
File "dist/scripts/components.js" created.

Running "concat:dist/scripts/templates.js" (concat) task
File "dist/scripts/templates.js" created.

Running "concat:dist/scripts/main.js" (concat) task
File "dist/scripts/main.js" created.

Running "cssmin:dist" (cssmin) task
File dist/styles/main.css created.

Running "cssmin:dist/styles/main.css" (cssmin) task
File dist/styles/main.css created.

Running "copy:dist" (copy) task
Copied 27 files

Running "usemin:html" (usemin) task

Processing as HTML - dist/index.html
Update the HTML to reference our concat/min/revved script files
Update the HTML with the new css filenames
Update the HTML with the new img filenames
Update the HTML with data-main tags
Update the HTML with the data tags
Update the HTML with background imgs, case there is some inline style
Update the HTML with anchors images
Update the HTML with reference in input

Running "usemin:css" (usemin) task

Processing as CSS - dist/styles/main.css
Update the CSS with new img filenames

Done, without errors.
[INFO] 
[INFO] --- maven-resources-plugin:2.6:resources (default-resources) @ tez-ui ---
[INFO] Using 'UTF-8' encoding to copy filtered resources.
[INFO] Copying 2 resources
[INFO] 
[INFO] --- maven-compiler-plugin:3.1:compile (default-compile) @ tez-ui ---
[INFO] No sources to compile
[INFO] 
[INFO] --- maven-resources-plugin:2.6:testResources (default-testResources) @ tez-ui ---
[INFO] Using 'UTF-8' encoding to copy filtered resources.
[INFO] skip non existing resourceDirectory <https://builds.apache.org/job/Tez-Build-Hadoop-2.4/ws/tez-ui/src/test/resources>
[INFO] 
[INFO] --- maven-compiler-plugin:3.1:testCompile (default-testCompile) @ tez-ui ---
[INFO] No sources to compile
[INFO] 
[INFO] --- maven-surefire-plugin:2.14.1:test (default-test) @ tez-ui ---
[INFO] No tests to run.
[INFO]                                                                         
[INFO] ------------------------------------------------------------------------
[INFO] Building tez-plugins 0.8.0-SNAPSHOT
[INFO] ------------------------------------------------------------------------
[INFO] 
[INFO] --- maven-clean-plugin:2.5:clean (default-clean) @ tez-plugins ---
[INFO] 
[INFO] --- buildnumber-maven-plugin:1.1:create (default) @ tez-plugins ---
[INFO] Checking for local modifications: skipped.
[INFO] Updating project files from SCM: skipped.
[INFO] Executing: /bin/sh -c cd <https://builds.apache.org/job/Tez-Build-Hadoop-2.4/ws/tez-plugins>
&& git rev-parse --verify HEAD
[INFO] Working directory: <https://builds.apache.org/job/Tez-Build-Hadoop-2.4/ws/tez-plugins>
[INFO] Storing buildNumber: ecd90dc1f79a4b1614174b75030b85feb8842793 at timestamp: 1439352623923
[INFO] Executing: /bin/sh -c cd <https://builds.apache.org/job/Tez-Build-Hadoop-2.4/ws/tez-plugins>
&& git rev-parse --verify HEAD
[INFO] Working directory: <https://builds.apache.org/job/Tez-Build-Hadoop-2.4/ws/tez-plugins>
[INFO] Storing buildScmBranch: UNKNOWN
[INFO] 
[INFO] --- build-helper-maven-plugin:1.8:maven-version (maven-version) @ tez-plugins ---
[INFO]                                                                         
[INFO] ------------------------------------------------------------------------
[INFO] Skipping tez-yarn-timeline-history
[INFO] This project has been banned from the build due to previous failures.
[INFO] ------------------------------------------------------------------------
[INFO]                                                                         
[INFO] ------------------------------------------------------------------------
[INFO] Skipping tez-history-parser
[INFO] This project has been banned from the build due to previous failures.
[INFO] ------------------------------------------------------------------------
[INFO]                                                                         
[INFO] ------------------------------------------------------------------------
[INFO] Building tez-mbeans-resource-calculator 0.8.0-SNAPSHOT
[INFO] ------------------------------------------------------------------------
[INFO] 
[INFO] --- maven-clean-plugin:2.5:clean (default-clean) @ tez-mbeans-resource-calculator ---
[INFO] Deleting <https://builds.apache.org/job/Tez-Build-Hadoop-2.4/ws/tez-plugins/tez-mbeans-resource-calculator/target>
[INFO] 
[INFO] --- buildnumber-maven-plugin:1.1:create (default) @ tez-mbeans-resource-calculator
---
[INFO] Checking for local modifications: skipped.
[INFO] Updating project files from SCM: skipped.
[INFO] Executing: /bin/sh -c cd <https://builds.apache.org/job/Tez-Build-Hadoop-2.4/ws/tez-plugins/tez-mbeans-resource-calculator>
&& git rev-parse --verify HEAD
[INFO] Working directory: <https://builds.apache.org/job/Tez-Build-Hadoop-2.4/ws/tez-plugins/tez-mbeans-resource-calculator>
[INFO] Storing buildNumber: ecd90dc1f79a4b1614174b75030b85feb8842793 at timestamp: 1439352623998
[INFO] Executing: /bin/sh -c cd <https://builds.apache.org/job/Tez-Build-Hadoop-2.4/ws/tez-plugins/tez-mbeans-resource-calculator>
&& git rev-parse --verify HEAD
[INFO] Working directory: <https://builds.apache.org/job/Tez-Build-Hadoop-2.4/ws/tez-plugins/tez-mbeans-resource-calculator>
[INFO] Storing buildScmBranch: UNKNOWN
[INFO] 
[INFO] --- build-helper-maven-plugin:1.8:maven-version (maven-version) @ tez-mbeans-resource-calculator
---
[INFO] 
[INFO] --- maven-resources-plugin:2.6:resources (default-resources) @ tez-mbeans-resource-calculator
---
[INFO] Using 'UTF-8' encoding to copy filtered resources.
[INFO] skip non existing resourceDirectory <https://builds.apache.org/job/Tez-Build-Hadoop-2.4/ws/tez-plugins/tez-mbeans-resource-calculator/src/main/resources>
[INFO] 
[INFO] --- maven-compiler-plugin:3.1:compile (default-compile) @ tez-mbeans-resource-calculator
---
[INFO] Changes detected - recompiling the module!
[INFO] Compiling 1 source file to <https://builds.apache.org/job/Tez-Build-Hadoop-2.4/ws/tez-plugins/tez-mbeans-resource-calculator/target/classes>
[INFO] 
[INFO] --- maven-resources-plugin:2.6:testResources (default-testResources) @ tez-mbeans-resource-calculator
---
[INFO] Using 'UTF-8' encoding to copy filtered resources.
[INFO] skip non existing resourceDirectory <https://builds.apache.org/job/Tez-Build-Hadoop-2.4/ws/tez-plugins/tez-mbeans-resource-calculator/src/test/resources>
[INFO] 
[INFO] --- maven-compiler-plugin:3.1:testCompile (default-testCompile) @ tez-mbeans-resource-calculator
---
[INFO] Changes detected - recompiling the module!
[INFO] Compiling 1 source file to <https://builds.apache.org/job/Tez-Build-Hadoop-2.4/ws/tez-plugins/tez-mbeans-resource-calculator/target/test-classes>
[INFO] 
[INFO] --- maven-surefire-plugin:2.14.1:test (default-test) @ tez-mbeans-resource-calculator
---
[INFO] Surefire report directory: <https://builds.apache.org/job/Tez-Build-Hadoop-2.4/ws/tez-plugins/tez-mbeans-resource-calculator/target/surefire-reports>

-------------------------------------------------------
 T E S T S
-------------------------------------------------------

-------------------------------------------------------
 T E S T S
-------------------------------------------------------
Running org.apache.tez.util.TestTezMxBeanResourceCalculator
Tests run: 1, Failures: 0, Errors: 0, Skipped: 0, Time elapsed: 0.417 sec

Results :

Tests run: 1, Failures: 0, Errors: 0, Skipped: 0

[INFO]                                                                         
[INFO] ------------------------------------------------------------------------
[INFO] Building tez-tools 0.8.0-SNAPSHOT
[INFO] ------------------------------------------------------------------------
[INFO] 
[INFO] --- maven-clean-plugin:2.5:clean (default-clean) @ tez-tools ---
[INFO] 
[INFO] --- buildnumber-maven-plugin:1.1:create (default) @ tez-tools ---
[INFO] Checking for local modifications: skipped.
[INFO] Updating project files from SCM: skipped.
[INFO] Executing: /bin/sh -c cd <https://builds.apache.org/job/Tez-Build-Hadoop-2.4/ws/tez-tools>
&& git rev-parse --verify HEAD
[INFO] Working directory: <https://builds.apache.org/job/Tez-Build-Hadoop-2.4/ws/tez-tools>
[INFO] Storing buildNumber: ecd90dc1f79a4b1614174b75030b85feb8842793 at timestamp: 1439352624882
[INFO] Executing: /bin/sh -c cd <https://builds.apache.org/job/Tez-Build-Hadoop-2.4/ws/tez-tools>
&& git rev-parse --verify HEAD
[INFO] Working directory: <https://builds.apache.org/job/Tez-Build-Hadoop-2.4/ws/tez-tools>
[INFO] Storing buildScmBranch: UNKNOWN
[INFO] 
[INFO] --- build-helper-maven-plugin:1.8:maven-version (maven-version) @ tez-tools ---
[INFO]                                                                         
[INFO] ------------------------------------------------------------------------
[INFO] Building tez-perf-analyzer 0.8.0-SNAPSHOT
[INFO] ------------------------------------------------------------------------
[INFO] 
[INFO] --- maven-clean-plugin:2.5:clean (default-clean) @ tez-perf-analyzer ---
[INFO] 
[INFO] --- buildnumber-maven-plugin:1.1:create (default) @ tez-perf-analyzer ---
[INFO] Checking for local modifications: skipped.
[INFO] Updating project files from SCM: skipped.
[INFO] Executing: /bin/sh -c cd <https://builds.apache.org/job/Tez-Build-Hadoop-2.4/ws/tez-tools/analyzers>
&& git rev-parse --verify HEAD
[INFO] Working directory: <https://builds.apache.org/job/Tez-Build-Hadoop-2.4/ws/tez-tools/analyzers>
[INFO] Storing buildNumber: ecd90dc1f79a4b1614174b75030b85feb8842793 at timestamp: 1439352624896
[INFO] Executing: /bin/sh -c cd <https://builds.apache.org/job/Tez-Build-Hadoop-2.4/ws/tez-tools/analyzers>
&& git rev-parse --verify HEAD
[INFO] Working directory: <https://builds.apache.org/job/Tez-Build-Hadoop-2.4/ws/tez-tools/analyzers>
[INFO] Storing buildScmBranch: UNKNOWN
[INFO] 
[INFO] --- build-helper-maven-plugin:1.8:maven-version (maven-version) @ tez-perf-analyzer
---
[INFO]                                                                         
[INFO] ------------------------------------------------------------------------
[INFO] Skipping tez-job-analyzer
[INFO] This project has been banned from the build due to previous failures.
[INFO] ------------------------------------------------------------------------
[INFO]                                                                         
[INFO] ------------------------------------------------------------------------
[INFO] Skipping tez-dist
[INFO] This project has been banned from the build due to previous failures.
[INFO] ------------------------------------------------------------------------
[INFO]                                                                         
[INFO] ------------------------------------------------------------------------
[INFO] Building Tez 0.8.0-SNAPSHOT
[INFO] ------------------------------------------------------------------------
[INFO] 
[INFO] --- maven-clean-plugin:2.5:clean (default-clean) @ tez-docs ---
[INFO] 
[INFO] --- buildnumber-maven-plugin:1.1:create (default) @ tez-docs ---
[INFO] Checking for local modifications: skipped.
[INFO] Updating project files from SCM: skipped.
[INFO] Executing: /bin/sh -c cd <https://builds.apache.org/job/Tez-Build-Hadoop-2.4/ws/docs>
&& git rev-parse --verify HEAD
[INFO] Working directory: <https://builds.apache.org/job/Tez-Build-Hadoop-2.4/ws/docs>
[INFO] Storing buildNumber: ecd90dc1f79a4b1614174b75030b85feb8842793 at timestamp: 1439352624909
[INFO] Executing: /bin/sh -c cd <https://builds.apache.org/job/Tez-Build-Hadoop-2.4/ws/docs>
&& git rev-parse --verify HEAD
[INFO] Working directory: <https://builds.apache.org/job/Tez-Build-Hadoop-2.4/ws/docs>
[INFO] Storing buildScmBranch: UNKNOWN
[INFO] 
[INFO] --- build-helper-maven-plugin:1.8:maven-version (maven-version) @ tez-docs ---
[INFO] ------------------------------------------------------------------------
[INFO] Reactor Summary:
[INFO] 
[INFO] tez ............................................... SUCCESS [  1.448 s]
[INFO] tez-api ........................................... SUCCESS [ 40.061 s]
[INFO] tez-common ........................................ SUCCESS [  3.468 s]
[INFO] tez-runtime-internals ............................. SUCCESS [ 11.473 s]
[INFO] tez-runtime-library ............................... SUCCESS [02:15 min]
[INFO] tez-mapreduce ..................................... SUCCESS [ 29.938 s]
[INFO] tez-examples ...................................... SUCCESS [  0.262 s]
[INFO] tez-dag ........................................... SUCCESS [02:11 min]
[INFO] tez-tests ......................................... FAILURE [26:55 min]
[INFO] tez-ui ............................................ SUCCESS [ 14.655 s]
[INFO] tez-plugins ....................................... SUCCESS [  0.015 s]
[INFO] tez-yarn-timeline-history ......................... SKIPPED
[INFO] tez-history-parser ................................ SKIPPED
[INFO] tez-mbeans-resource-calculator .................... SUCCESS [  0.942 s]
[INFO] tez-tools ......................................... SUCCESS [  0.015 s]
[INFO] tez-perf-analyzer ................................. SUCCESS [  0.013 s]
[INFO] tez-job-analyzer .................................. SKIPPED
[INFO] tez-dist .......................................... SKIPPED
[INFO] Tez ............................................... SUCCESS [  0.012 s]
[INFO] ------------------------------------------------------------------------
[INFO] BUILD FAILURE
[INFO] ------------------------------------------------------------------------
[INFO] Total time: 33:05 min
[INFO] Finished at: 2015-08-12T04:10:24+00:00
[INFO] Final Memory: 65M/743M
[INFO] ------------------------------------------------------------------------
[ERROR] Failed to execute goal org.apache.maven.plugins:maven-surefire-plugin:2.14.1:test
(default-test) on project tez-tests: ExecutionException; nested exception is java.util.concurrent.ExecutionException:
java.lang.RuntimeException: The forked VM terminated without saying properly goodbye. VM crash
or System.exit called ?
[ERROR] Command was/bin/sh -c cd <https://builds.apache.org/job/Tez-Build-Hadoop-2.4/ws/tez-tests>
&& /home/jenkins/tools/java/jdk1.7.0_55/jre/bin/java -Xmx1024m -XX:+HeapDumpOnOutOfMemoryError
-jar <https://builds.apache.org/job/Tez-Build-Hadoop-2.4/ws/tez-tests/target/surefire/surefirebooter5250059857465104385.jar>
<https://builds.apache.org/job/Tez-Build-Hadoop-2.4/ws/tez-tests/target/surefire/surefire3066216788027993001tmp>
<https://builds.apache.org/job/Tez-Build-Hadoop-2.4/ws/tez-tests/target/surefire/surefire_1328155510199895702805tmp>
[ERROR] -> [Help 1]
[ERROR] 
[ERROR] To see the full stack trace of the errors, re-run Maven with the -e switch.
[ERROR] Re-run Maven using the -X switch to enable full debug logging.
[ERROR] 
[ERROR] For more information about the errors and possible solutions, please read the following
articles:
[ERROR] [Help 1] http://cwiki.apache.org/confluence/display/MAVEN/MojoFailureException
[ERROR] 
[ERROR] After correcting the problems, you can resume the build with the command
[ERROR]   mvn <goals> -rf :tez-tests
Build step 'Execute shell' marked build as failure
Recording test results

Mime
View raw message