tez-dev mailing list archives

Site index · List index
Message view « Date » · « Thread »
Top « Date » · « Thread »
From Apache Jenkins Server <jenk...@builds.apache.org>
Subject Build failed in Jenkins: Tez-Build-branch-tez-2003 #17
Date Sat, 15 Aug 2015 04:48:07 GMT
See <https://builds.apache.org/job/Tez-Build-branch-tez-2003/17/>

------------------------------------------
[...truncated 3967 lines...]
              
Uploaded: https://repository.apache.org/content/repositories/snapshots/org/apache/tez/tez-api/0.8.0-TEZ-2003-SNAPSHOT/maven-metadata.xml
(1023 B at 3.0 KB/sec)
Downloading: https://repository.apache.org/content/repositories/snapshots/org/apache/tez/tez-common/0.8.0-TEZ-2003-SNAPSHOT/maven-metadata.xml
2/2 KB        
         
Downloaded: https://repository.apache.org/content/repositories/snapshots/org/apache/tez/tez-common/0.8.0-TEZ-2003-SNAPSHOT/maven-metadata.xml
(2 KB at 0.9 KB/sec)
Uploading: https://repository.apache.org/content/repositories/snapshots/org/apache/tez/tez-common/0.8.0-TEZ-2003-SNAPSHOT/tez-common-0.8.0-TEZ-2003-20150815.044450-16.jar
2/70 KB   
4/70 KB   
6/70 KB   
8/70 KB   
10/70 KB   
12/70 KB   
14/70 KB   
16/70 KB   
18/70 KB   
20/70 KB   
22/70 KB   
24/70 KB   
26/70 KB   
28/70 KB   
30/70 KB   
32/70 KB   
34/70 KB   
36/70 KB   
38/70 KB   
40/70 KB   
42/70 KB   
44/70 KB   
46/70 KB   
48/70 KB   
50/70 KB   
52/70 KB   
54/70 KB   
56/70 KB   
58/70 KB   
60/70 KB   
62/70 KB   
64/70 KB   
66/70 KB   
68/70 KB   
70/70 KB   
           
Uploaded: https://repository.apache.org/content/repositories/snapshots/org/apache/tez/tez-common/0.8.0-TEZ-2003-SNAPSHOT/tez-common-0.8.0-TEZ-2003-20150815.044450-16.jar
(70 KB at 93.0 KB/sec)
Uploading: https://repository.apache.org/content/repositories/snapshots/org/apache/tez/tez-common/0.8.0-TEZ-2003-SNAPSHOT/tez-common-0.8.0-TEZ-2003-20150815.044450-16.pom
2/3 KB     
3/3 KB   
         
Uploaded: https://repository.apache.org/content/repositories/snapshots/org/apache/tez/tez-common/0.8.0-TEZ-2003-SNAPSHOT/tez-common-0.8.0-TEZ-2003-20150815.044450-16.pom
(3 KB at 4.4 KB/sec)
Downloading: https://repository.apache.org/content/repositories/snapshots/org/apache/tez/tez-common/maven-metadata.xml
573/573 B   
            
Downloaded: https://repository.apache.org/content/repositories/snapshots/org/apache/tez/tez-common/maven-metadata.xml
(573 B at 1.0 KB/sec)
Uploading: https://repository.apache.org/content/repositories/snapshots/org/apache/tez/tez-common/0.8.0-TEZ-2003-SNAPSHOT/maven-metadata.xml
2/2 KB      
         
Uploaded: https://repository.apache.org/content/repositories/snapshots/org/apache/tez/tez-common/0.8.0-TEZ-2003-SNAPSHOT/maven-metadata.xml
(2 KB at 0.6 KB/sec)
Uploading: https://repository.apache.org/content/repositories/snapshots/org/apache/tez/tez-common/maven-metadata.xml
573/573 B   
            
Uploaded: https://repository.apache.org/content/repositories/snapshots/org/apache/tez/tez-common/maven-metadata.xml
(573 B at 1.2 KB/sec)
Uploading: https://repository.apache.org/content/repositories/snapshots/org/apache/tez/tez-common/0.8.0-TEZ-2003-SNAPSHOT/tez-common-0.8.0-TEZ-2003-20150815.044450-16-tests.jar
2/37 KB     
4/37 KB   
6/37 KB   
8/37 KB   
10/37 KB   
12/37 KB   
14/37 KB   
16/37 KB   
18/37 KB   
20/37 KB   
22/37 KB   
24/37 KB   
26/37 KB   
28/37 KB   
30/37 KB   
32/37 KB   
34/37 KB   
36/37 KB   
37/37 KB   
           
Uploaded: https://repository.apache.org/content/repositories/snapshots/org/apache/tez/tez-common/0.8.0-TEZ-2003-SNAPSHOT/tez-common-0.8.0-TEZ-2003-20150815.044450-16-tests.jar
(37 KB at 67.9 KB/sec)
Uploading: https://repository.apache.org/content/repositories/snapshots/org/apache/tez/tez-common/0.8.0-TEZ-2003-SNAPSHOT/maven-metadata.xml
2/2 KB     
         
Uploaded: https://repository.apache.org/content/repositories/snapshots/org/apache/tez/tez-common/0.8.0-TEZ-2003-SNAPSHOT/maven-metadata.xml
(2 KB at 2.3 KB/sec)
Downloading: https://repository.apache.org/content/repositories/snapshots/org/apache/tez/tez-runtime-internals/0.8.0-TEZ-2003-SNAPSHOT/maven-metadata.xml
2/2 KB   
         
Downloaded: https://repository.apache.org/content/repositories/snapshots/org/apache/tez/tez-runtime-internals/0.8.0-TEZ-2003-SNAPSHOT/maven-metadata.xml
(2 KB at 0.4 KB/sec)
Uploading: https://repository.apache.org/content/repositories/snapshots/org/apache/tez/tez-runtime-internals/0.8.0-TEZ-2003-SNAPSHOT/tez-runtime-internals-0.8.0-TEZ-2003-20150815.044457-16.jar
2/177 KB   
4/177 KB   
6/177 KB   
8/177 KB   
10/177 KB   
12/177 KB   
14/177 KB   
16/177 KB   
18/177 KB   
20/177 KB   
22/177 KB   
24/177 KB   
26/177 KB   
28/177 KB   
30/177 KB   
32/177 KB   
34/177 KB   
36/177 KB   
38/177 KB   
40/177 KB   
42/177 KB   
44/177 KB   
46/177 KB   
48/177 KB   
50/177 KB   
52/177 KB   
54/177 KB   
56/177 KB   
58/177 KB   
60/177 KB   
62/177 KB   
64/177 KB   
66/177 KB   
68/177 KB   
70/177 KB   
72/177 KB   
74/177 KB   
76/177 KB   
78/177 KB   
80/177 KB   
82/177 KB   
84/177 KB   
86/177 KB   
88/177 KB   
90/177 KB   
92/177 KB   
94/177 KB   
96/177 KB   
98/177 KB   
100/177 KB   
102/177 KB   
104/177 KB   
106/177 KB   
108/177 KB   
110/177 KB   
112/177 KB   
114/177 KB   
116/177 KB   
118/177 KB   
120/177 KB   
122/177 KB   
124/177 KB   
126/177 KB   
128/177 KB   
130/177 KB   
132/177 KB   
134/177 KB   
136/177 KB   
138/177 KB   
140/177 KB   
142/177 KB   
144/177 KB   
146/177 KB   
148/177 KB   
150/177 KB   
152/177 KB   
154/177 KB   
156/177 KB   
158/177 KB   
160/177 KB   
162/177 KB   
164/177 KB   
166/177 KB   
168/177 KB   
170/177 KB   
172/177 KB   
174/177 KB   
176/177 KB   
177/177 KB   
             
Uploaded: https://repository.apache.org/content/repositories/snapshots/org/apache/tez/tez-runtime-internals/0.8.0-TEZ-2003-SNAPSHOT/tez-runtime-internals-0.8.0-TEZ-2003-20150815.044457-16.jar
(177 KB at 222.9 KB/sec)
Uploading: https://repository.apache.org/content/repositories/snapshots/org/apache/tez/tez-runtime-internals/0.8.0-TEZ-2003-SNAPSHOT/tez-runtime-internals-0.8.0-TEZ-2003-20150815.044457-16.pom
2/4 KB       
4/4 KB   
         
Uploaded: https://repository.apache.org/content/repositories/snapshots/org/apache/tez/tez-runtime-internals/0.8.0-TEZ-2003-SNAPSHOT/tez-runtime-internals-0.8.0-TEZ-2003-20150815.044457-16.pom
(4 KB at 5.0 KB/sec)
Downloading: https://repository.apache.org/content/repositories/snapshots/org/apache/tez/tez-runtime-internals/maven-metadata.xml
584/584 B   
            
Downloaded: https://repository.apache.org/content/repositories/snapshots/org/apache/tez/tez-runtime-internals/maven-metadata.xml
(584 B at 0.0 KB/sec)
Uploading: https://repository.apache.org/content/repositories/snapshots/org/apache/tez/tez-runtime-internals/0.8.0-TEZ-2003-SNAPSHOT/maven-metadata.xml
2/2 KB      
[WARNING] Failed to upload SHA-1 checksum for /home/jenkins/.m2/repository/org/apache/tez/tez-runtime-internals/0.8.0-TEZ-2003-SNAPSHOT/maven-metadata-apache.snapshots.https.xml:
Failed to transfer file: https://repository.apache.org/content/repositories/snapshots/org/apache/tez/tez-runtime-internals/0.8.0-TEZ-2003-SNAPSHOT/maven-metadata.xml.sha1.
Return code is: 502, ReasonPhrase: Proxy Error.
         
Uploaded: https://repository.apache.org/content/repositories/snapshots/org/apache/tez/tez-runtime-internals/0.8.0-TEZ-2003-SNAPSHOT/maven-metadata.xml
(2 KB at 0.0 KB/sec)
Uploading: https://repository.apache.org/content/repositories/snapshots/org/apache/tez/tez-runtime-internals/maven-metadata.xml
584/584 B   
            
[INFO] ------------------------------------------------------------------------
[INFO] Reactor Summary:
[INFO] 
[INFO] tez ............................................... SUCCESS [  1.691 s]
[INFO] tez-api ........................................... SUCCESS [ 14.385 s]
[INFO] tez-common ........................................ SUCCESS [  0.637 s]
[INFO] tez-runtime-internals ............................. SUCCESS [  1.057 s]
[INFO] tez-runtime-library ............................... SUCCESS [  3.088 s]
[INFO] tez-mapreduce ..................................... SUCCESS [  1.727 s]
[INFO] tez-examples ...................................... SUCCESS [  0.401 s]
[INFO] tez-dag ........................................... SUCCESS [  7.224 s]
[INFO] tez-tests ......................................... SUCCESS [  0.914 s]
[INFO] tez-ext-service-tests ............................. SUCCESS [  1.096 s]
[INFO] tez-ui ............................................ SUCCESS [ 48.655 s]
[INFO] tez-plugins ....................................... SUCCESS [  0.101 s]
[INFO] tez-yarn-timeline-history ......................... SUCCESS [  0.695 s]
[INFO] tez-yarn-timeline-history-with-acls ............... SUCCESS [  0.432 s]
[INFO] tez-history-parser ................................ SUCCESS [ 25.805 s]
[INFO] tez-mbeans-resource-calculator .................... SUCCESS [  0.524 s]
[INFO] tez-tools ......................................... SUCCESS [  0.108 s]
[INFO] tez-perf-analyzer ................................. SUCCESS [  0.057 s]
[INFO] tez-job-analyzer .................................. SUCCESS [  0.279 s]
[INFO] tez-dist .......................................... SUCCESS [ 24.233 s]
[INFO] Tez ............................................... FAILURE [05:50 min]
[INFO] ------------------------------------------------------------------------
[INFO] BUILD FAILURE
[INFO] ------------------------------------------------------------------------
[INFO] Total time: 08:04 min
[INFO] Finished at: 2015-08-15T04:48:45+00:00
[INFO] Final Memory: 106M/1120M
[INFO] ------------------------------------------------------------------------
[ERROR] Failed to execute goal org.apache.maven.plugins:maven-deploy-plugin:2.8.1:deploy (default-deploy)
on project tez-docs: Failed to deploy metadata: Could not transfer metadata org.apache.tez:tez-runtime-internals/maven-metadata.xml
from/to apache.snapshots.https (https://repository.apache.org/content/repositories/snapshots):
Failed to transfer file: https://repository.apache.org/content/repositories/snapshots/org/apache/tez/tez-runtime-internals/maven-metadata.xml.
Return code is: 502, ReasonPhrase: Proxy Error. -> [Help 1]
[ERROR] 
[ERROR] To see the full stack trace of the errors, re-run Maven with the -e switch.
[ERROR] Re-run Maven using the -X switch to enable full debug logging.
[ERROR] 
[ERROR] For more information about the errors and possible solutions, please read the following
articles:
[ERROR] [Help 1] http://cwiki.apache.org/confluence/display/MAVEN/MojoExecutionException
[ERROR] 
[ERROR] After correcting the problems, you can resume the build with the command
[ERROR]   mvn <goals> -rf :tez-docs
Build step 'Execute shell' marked build as failure
Archiving artifacts
Sending artifact delta relative to Tez-Build-branch-tez-2003 #16
Archived 2 artifacts
Archive block size is 32768
Received 0 blocks and 54679692 bytes
Compression is 0.0%
Took 13 sec

Mime
View raw message