tez-dev mailing list archives

Site index · List index
Message view « Date » · « Thread »
Top « Date » · « Thread »
From Apache Jenkins Server <jenk...@builds.apache.org>
Subject Build failed in Jenkins: Tez-Build-Hadoop-2.2 #158
Date Wed, 26 Aug 2015 00:05:13 GMT
See <https://builds.apache.org/job/Tez-Build-Hadoop-2.2/158/changes>

Changes:

[bikas] TEZ-2690. Add critical path analyser (bikas)

[bikas] TEZ-2740. Create a reconfigureVertex alias for deprecated setVertexParallelism API
(bikas)

[gopalv] TEZ-2731: Fix Tez GenericCounter performance bottleneck (Gopal V, reviewed by Rajesh
Balamohan)

------------------------------------------
[...truncated 1185 lines...]
[INFO] Building tez-plugins 0.8.0-SNAPSHOT
[INFO] ------------------------------------------------------------------------
[INFO] 
[INFO] --- maven-clean-plugin:2.5:clean (default-clean) @ tez-plugins ---
[INFO] 
[INFO] --- buildnumber-maven-plugin:1.1:create (default) @ tez-plugins ---
[INFO] Checking for local modifications: skipped.
[INFO] Updating project files from SCM: skipped.
[INFO] Executing: /bin/sh -c cd <https://builds.apache.org/job/Tez-Build-Hadoop-2.2/ws/tez-plugins>
&& git rev-parse --verify HEAD
[INFO] Working directory: <https://builds.apache.org/job/Tez-Build-Hadoop-2.2/ws/tez-plugins>
[INFO] Storing buildNumber: dc0ee0115cef3d0ad6ea64c3f93042a081d66472 at timestamp: 1440547571373
[INFO] Executing: /bin/sh -c cd <https://builds.apache.org/job/Tez-Build-Hadoop-2.2/ws/tez-plugins>
&& git rev-parse --verify HEAD
[INFO] Working directory: <https://builds.apache.org/job/Tez-Build-Hadoop-2.2/ws/tez-plugins>
[INFO] Storing buildScmBranch: UNKNOWN
[INFO] 
[INFO] --- build-helper-maven-plugin:1.8:maven-version (maven-version) @ tez-plugins ---
[INFO]                                                                         
[INFO] ------------------------------------------------------------------------
[INFO] Building tez-mbeans-resource-calculator 0.8.0-SNAPSHOT
[INFO] ------------------------------------------------------------------------
[INFO] 
[INFO] --- maven-clean-plugin:2.5:clean (default-clean) @ tez-mbeans-resource-calculator ---
[INFO] Deleting <https://builds.apache.org/job/Tez-Build-Hadoop-2.2/ws/tez-plugins/tez-mbeans-resource-calculator/target>
[INFO] 
[INFO] --- buildnumber-maven-plugin:1.1:create (default) @ tez-mbeans-resource-calculator
---
[INFO] Checking for local modifications: skipped.
[INFO] Updating project files from SCM: skipped.
[INFO] Executing: /bin/sh -c cd <https://builds.apache.org/job/Tez-Build-Hadoop-2.2/ws/tez-plugins/tez-mbeans-resource-calculator>
&& git rev-parse --verify HEAD
[INFO] Working directory: <https://builds.apache.org/job/Tez-Build-Hadoop-2.2/ws/tez-plugins/tez-mbeans-resource-calculator>
[INFO] Storing buildNumber: dc0ee0115cef3d0ad6ea64c3f93042a081d66472 at timestamp: 1440547571485
[INFO] Executing: /bin/sh -c cd <https://builds.apache.org/job/Tez-Build-Hadoop-2.2/ws/tez-plugins/tez-mbeans-resource-calculator>
&& git rev-parse --verify HEAD
[INFO] Working directory: <https://builds.apache.org/job/Tez-Build-Hadoop-2.2/ws/tez-plugins/tez-mbeans-resource-calculator>
[INFO] Storing buildScmBranch: UNKNOWN
[INFO] 
[INFO] --- build-helper-maven-plugin:1.8:maven-version (maven-version) @ tez-mbeans-resource-calculator
---
[INFO] 
[INFO] --- maven-resources-plugin:2.6:resources (default-resources) @ tez-mbeans-resource-calculator
---
[INFO] Using 'UTF-8' encoding to copy filtered resources.
[INFO] skip non existing resourceDirectory <https://builds.apache.org/job/Tez-Build-Hadoop-2.2/ws/tez-plugins/tez-mbeans-resource-calculator/src/main/resources>
[INFO] 
[INFO] --- maven-compiler-plugin:3.1:compile (default-compile) @ tez-mbeans-resource-calculator
---
[INFO] Changes detected - recompiling the module!
[INFO] Compiling 1 source file to <https://builds.apache.org/job/Tez-Build-Hadoop-2.2/ws/tez-plugins/tez-mbeans-resource-calculator/target/classes>
[INFO] 
[INFO] --- maven-resources-plugin:2.6:testResources (default-testResources) @ tez-mbeans-resource-calculator
---
[INFO] Using 'UTF-8' encoding to copy filtered resources.
[INFO] skip non existing resourceDirectory <https://builds.apache.org/job/Tez-Build-Hadoop-2.2/ws/tez-plugins/tez-mbeans-resource-calculator/src/test/resources>
[INFO] 
[INFO] --- maven-compiler-plugin:3.1:testCompile (default-testCompile) @ tez-mbeans-resource-calculator
---
[INFO] Changes detected - recompiling the module!
[INFO] Compiling 1 source file to <https://builds.apache.org/job/Tez-Build-Hadoop-2.2/ws/tez-plugins/tez-mbeans-resource-calculator/target/test-classes>
[INFO] 
[INFO] --- maven-surefire-plugin:2.14.1:test (default-test) @ tez-mbeans-resource-calculator
---
[INFO] Surefire report directory: <https://builds.apache.org/job/Tez-Build-Hadoop-2.2/ws/tez-plugins/tez-mbeans-resource-calculator/target/surefire-reports>

-------------------------------------------------------
 T E S T S
-------------------------------------------------------

-------------------------------------------------------
 T E S T S
-------------------------------------------------------
Running org.apache.tez.util.TestTezMxBeanResourceCalculator
Tests run: 1, Failures: 0, Errors: 0, Skipped: 0, Time elapsed: 0.379 sec

Results :

Tests run: 1, Failures: 0, Errors: 0, Skipped: 0

[INFO]                                                                         
[INFO] ------------------------------------------------------------------------
[INFO] Building tez-tools 0.8.0-SNAPSHOT
[INFO] ------------------------------------------------------------------------
[INFO] 
[INFO] --- maven-clean-plugin:2.5:clean (default-clean) @ tez-tools ---
[INFO] 
[INFO] --- buildnumber-maven-plugin:1.1:create (default) @ tez-tools ---
[INFO] Checking for local modifications: skipped.
[INFO] Updating project files from SCM: skipped.
[INFO] Executing: /bin/sh -c cd <https://builds.apache.org/job/Tez-Build-Hadoop-2.2/ws/tez-tools>
&& git rev-parse --verify HEAD
[INFO] Working directory: <https://builds.apache.org/job/Tez-Build-Hadoop-2.2/ws/tez-tools>
[INFO] Storing buildNumber: dc0ee0115cef3d0ad6ea64c3f93042a081d66472 at timestamp: 1440547572302
[INFO] Executing: /bin/sh -c cd <https://builds.apache.org/job/Tez-Build-Hadoop-2.2/ws/tez-tools>
&& git rev-parse --verify HEAD
[INFO] Working directory: <https://builds.apache.org/job/Tez-Build-Hadoop-2.2/ws/tez-tools>
[INFO] Storing buildScmBranch: UNKNOWN
[INFO] 
[INFO] --- build-helper-maven-plugin:1.8:maven-version (maven-version) @ tez-tools ---
[INFO]                                                                         
[INFO] ------------------------------------------------------------------------
[INFO] Building tez-perf-analyzer 0.8.0-SNAPSHOT
[INFO] ------------------------------------------------------------------------
[INFO] 
[INFO] --- maven-clean-plugin:2.5:clean (default-clean) @ tez-perf-analyzer ---
[INFO] 
[INFO] --- buildnumber-maven-plugin:1.1:create (default) @ tez-perf-analyzer ---
[INFO] Checking for local modifications: skipped.
[INFO] Updating project files from SCM: skipped.
[INFO] Executing: /bin/sh -c cd <https://builds.apache.org/job/Tez-Build-Hadoop-2.2/ws/tez-tools/analyzers>
&& git rev-parse --verify HEAD
[INFO] Working directory: <https://builds.apache.org/job/Tez-Build-Hadoop-2.2/ws/tez-tools/analyzers>
[INFO] Storing buildNumber: dc0ee0115cef3d0ad6ea64c3f93042a081d66472 at timestamp: 1440547572317
[INFO] Executing: /bin/sh -c cd <https://builds.apache.org/job/Tez-Build-Hadoop-2.2/ws/tez-tools/analyzers>
&& git rev-parse --verify HEAD
[INFO] Working directory: <https://builds.apache.org/job/Tez-Build-Hadoop-2.2/ws/tez-tools/analyzers>
[INFO] Storing buildScmBranch: UNKNOWN
[INFO] 
[INFO] --- build-helper-maven-plugin:1.8:maven-version (maven-version) @ tez-perf-analyzer
---
[INFO]                                                                         
[INFO] ------------------------------------------------------------------------
[INFO] Building tez-job-analyzer 0.8.0-SNAPSHOT
[INFO] ------------------------------------------------------------------------
Downloading: https://repository.apache.org/content/repositories/snapshots/org/apache/tez/tez-history-parser/0.8.0-SNAPSHOT/maven-metadata.xml

Downloading: https://repository.apache.org/content/repositories/snapshots/org/apache/tez/tez-yarn-timeline-history/0.8.0-SNAPSHOT/maven-metadata.xml
1009/1009 B   
              
Downloaded: https://repository.apache.org/content/repositories/snapshots/org/apache/tez/tez-yarn-timeline-history/0.8.0-SNAPSHOT/maven-metadata.xml
(1009 B at 4.3 KB/sec)
Downloading: https://repository.apache.org/content/repositories/snapshots/org/apache/tez/tez-yarn-timeline-history/0.8.0-SNAPSHOT/tez-yarn-timeline-history-0.8.0-20150825.231117-116.pom
4/5 KB        
5/5 KB   
         
Downloaded: https://repository.apache.org/content/repositories/snapshots/org/apache/tez/tez-yarn-timeline-history/0.8.0-SNAPSHOT/tez-yarn-timeline-history-0.8.0-20150825.231117-116.pom
(5 KB at 10.0 KB/sec)
Downloading: https://repository.apache.org/content/repositories/snapshots/org/apache/tez/tez-yarn-timeline-history/0.8.0-SNAPSHOT/tez-yarn-timeline-history-0.8.0-20150825.231117-116.jar
4/25 KB   
8/25 KB   
8/25 KB   
12/25 KB   
14/25 KB   
18/25 KB   
22/25 KB   
22/25 KB   
25/25 KB   
           
Downloaded: https://repository.apache.org/content/repositories/snapshots/org/apache/tez/tez-yarn-timeline-history/0.8.0-SNAPSHOT/tez-yarn-timeline-history-0.8.0-20150825.231117-116.jar
(25 KB at 41.2 KB/sec)
[INFO] 
[INFO] --- maven-clean-plugin:2.5:clean (default-clean) @ tez-job-analyzer ---
[INFO] Deleting <https://builds.apache.org/job/Tez-Build-Hadoop-2.2/ws/tez-tools/analyzers/job-analyzer/target>
[INFO] 
[INFO] --- buildnumber-maven-plugin:1.1:create (default) @ tez-job-analyzer ---
[INFO] Checking for local modifications: skipped.
[INFO] Updating project files from SCM: skipped.
[INFO] Executing: /bin/sh -c cd <https://builds.apache.org/job/Tez-Build-Hadoop-2.2/ws/tez-tools/analyzers/job-analyzer>
&& git rev-parse --verify HEAD
[INFO] Working directory: <https://builds.apache.org/job/Tez-Build-Hadoop-2.2/ws/tez-tools/analyzers/job-analyzer>
[INFO] Storing buildNumber: dc0ee0115cef3d0ad6ea64c3f93042a081d66472 at timestamp: 1440547574415
[INFO] Executing: /bin/sh -c cd <https://builds.apache.org/job/Tez-Build-Hadoop-2.2/ws/tez-tools/analyzers/job-analyzer>
&& git rev-parse --verify HEAD
[INFO] Working directory: <https://builds.apache.org/job/Tez-Build-Hadoop-2.2/ws/tez-tools/analyzers/job-analyzer>
[INFO] Storing buildScmBranch: UNKNOWN
[INFO] 
[INFO] --- build-helper-maven-plugin:1.8:maven-version (maven-version) @ tez-job-analyzer
---
[INFO] 
[INFO] --- maven-resources-plugin:2.6:resources (default-resources) @ tez-job-analyzer ---
[INFO] Using 'UTF-8' encoding to copy filtered resources.
[INFO] skip non existing resourceDirectory <https://builds.apache.org/job/Tez-Build-Hadoop-2.2/ws/tez-tools/analyzers/job-analyzer/src/main/resources>
[INFO] 
[INFO] --- maven-compiler-plugin:3.1:compile (default-compile) @ tez-job-analyzer ---
[INFO] Changes detected - recompiling the module!
[INFO] Compiling 18 source files to <https://builds.apache.org/job/Tez-Build-Hadoop-2.2/ws/tez-tools/analyzers/job-analyzer/target/classes>
[INFO] 
[INFO] --- maven-resources-plugin:2.6:testResources (default-testResources) @ tez-job-analyzer
---
[INFO] Using 'UTF-8' encoding to copy filtered resources.
[INFO] skip non existing resourceDirectory <https://builds.apache.org/job/Tez-Build-Hadoop-2.2/ws/tez-tools/analyzers/job-analyzer/src/test/resources>
[INFO] 
[INFO] --- maven-compiler-plugin:3.1:testCompile (default-testCompile) @ tez-job-analyzer
---
[INFO] No sources to compile
[INFO] 
[INFO] --- maven-surefire-plugin:2.14.1:test (default-test) @ tez-job-analyzer ---
[INFO] No tests to run.
[INFO]                                                                         
[INFO] ------------------------------------------------------------------------
[INFO] Building tez-dist 0.8.0-SNAPSHOT
[INFO] ------------------------------------------------------------------------
[INFO] 
[INFO] --- maven-clean-plugin:2.5:clean (default-clean) @ tez-dist ---
[INFO] 
[INFO] --- buildnumber-maven-plugin:1.1:create (default) @ tez-dist ---
[INFO] Checking for local modifications: skipped.
[INFO] Updating project files from SCM: skipped.
[INFO] Executing: /bin/sh -c cd <https://builds.apache.org/job/Tez-Build-Hadoop-2.2/ws/tez-dist>
&& git rev-parse --verify HEAD
[INFO] Working directory: <https://builds.apache.org/job/Tez-Build-Hadoop-2.2/ws/tez-dist>
[INFO] Storing buildNumber: dc0ee0115cef3d0ad6ea64c3f93042a081d66472 at timestamp: 1440547574621
[INFO] Executing: /bin/sh -c cd <https://builds.apache.org/job/Tez-Build-Hadoop-2.2/ws/tez-dist>
&& git rev-parse --verify HEAD
[INFO] Working directory: <https://builds.apache.org/job/Tez-Build-Hadoop-2.2/ws/tez-dist>
[INFO] Storing buildScmBranch: UNKNOWN
[INFO] 
[INFO] --- build-helper-maven-plugin:1.8:maven-version (maven-version) @ tez-dist ---
[INFO]                                                                         
[INFO] ------------------------------------------------------------------------
[INFO] Building Tez 0.8.0-SNAPSHOT
[INFO] ------------------------------------------------------------------------
[INFO] 
[INFO] --- maven-clean-plugin:2.5:clean (default-clean) @ tez-docs ---
[INFO] 
[INFO] --- buildnumber-maven-plugin:1.1:create (default) @ tez-docs ---
[INFO] Checking for local modifications: skipped.
[INFO] Updating project files from SCM: skipped.
[INFO] Executing: /bin/sh -c cd <https://builds.apache.org/job/Tez-Build-Hadoop-2.2/ws/docs>
&& git rev-parse --verify HEAD
[INFO] Working directory: <https://builds.apache.org/job/Tez-Build-Hadoop-2.2/ws/docs>
[INFO] Storing buildNumber: dc0ee0115cef3d0ad6ea64c3f93042a081d66472 at timestamp: 1440547574636
[INFO] Executing: /bin/sh -c cd <https://builds.apache.org/job/Tez-Build-Hadoop-2.2/ws/docs>
&& git rev-parse --verify HEAD
[INFO] Working directory: <https://builds.apache.org/job/Tez-Build-Hadoop-2.2/ws/docs>
[INFO] Storing buildScmBranch: UNKNOWN
[INFO] 
[INFO] --- build-helper-maven-plugin:1.8:maven-version (maven-version) @ tez-docs ---
[INFO] ------------------------------------------------------------------------
[INFO] Reactor Summary:
[INFO] 
[INFO] tez ............................................... SUCCESS [  1.377 s]
[INFO] tez-api ........................................... SUCCESS [ 37.911 s]
[INFO] tez-common ........................................ SUCCESS [  3.450 s]
[INFO] tez-runtime-internals ............................. SUCCESS [ 14.347 s]
[INFO] tez-runtime-library ............................... SUCCESS [02:06 min]
[INFO] tez-mapreduce ..................................... SUCCESS [ 28.157 s]
[INFO] tez-examples ...................................... SUCCESS [  0.287 s]
[INFO] tez-dag ........................................... SUCCESS [02:12 min]
[INFO] tez-tests ......................................... SUCCESS [27:45 min]
[INFO] tez-ext-service-tests ............................. FAILURE [  0.659 s]
[INFO] tez-ui ............................................ SUCCESS [ 16.673 s]
[INFO] tez-plugins ....................................... SUCCESS [  0.014 s]
[INFO] tez-mbeans-resource-calculator .................... SUCCESS [  0.914 s]
[INFO] tez-tools ......................................... SUCCESS [  0.014 s]
[INFO] tez-perf-analyzer ................................. SUCCESS [  0.014 s]
[INFO] tez-job-analyzer .................................. SUCCESS [  2.292 s]
[INFO] tez-dist .......................................... SUCCESS [  0.013 s]
[INFO] Tez ............................................... SUCCESS [  0.014 s]
[INFO] ------------------------------------------------------------------------
[INFO] BUILD FAILURE
[INFO] ------------------------------------------------------------------------
[INFO] Total time: 33:50 min
[INFO] Finished at: 2015-08-26T00:06:14+00:00
[INFO] Final Memory: 62M/927M
[INFO] ------------------------------------------------------------------------
[ERROR] Failed to execute goal org.apache.maven.plugins:maven-compiler-plugin:3.1:testCompile
(default-testCompile) on project tez-ext-service-tests: Compilation failure: Compilation failure:
[ERROR] <https://builds.apache.org/job/Tez-Build-Hadoop-2.2/ws/tez-ext-service-tests/src/test/java/org/apache/tez/shufflehandler/ShuffleHandler.java>:[693,46]
constructor FadvisedFileRegion in class org.apache.hadoop.mapred.FadvisedFileRegion cannot
be applied to given types;
[ERROR] required: java.io.RandomAccessFile,long,long,boolean,int,org.apache.hadoop.io.ReadaheadPool,java.lang.String
[ERROR] found: java.io.RandomAccessFile,long,long,boolean,int,org.apache.hadoop.io.ReadaheadPool,java.lang.String,int,boolean
[ERROR] reason: actual and formal argument lists differ in length
[ERROR] <https://builds.apache.org/job/Tez-Build-Hadoop-2.2/ws/tez-ext-service-tests/src/test/java/org/apache/tez/shufflehandler/ShuffleHandler.java>:[704,24]
cannot find symbol
[ERROR] symbol:   method transferSuccessful()
[ERROR] location: variable partition of type org.apache.hadoop.mapred.FadvisedFileRegion
[ERROR] -> [Help 1]
[ERROR] 
[ERROR] To see the full stack trace of the errors, re-run Maven with the -e switch.
[ERROR] Re-run Maven using the -X switch to enable full debug logging.
[ERROR] 
[ERROR] For more information about the errors and possible solutions, please read the following
articles:
[ERROR] [Help 1] http://cwiki.apache.org/confluence/display/MAVEN/MojoFailureException
[ERROR] 
[ERROR] After correcting the problems, you can resume the build with the command
[ERROR]   mvn <goals> -rf :tez-ext-service-tests
Build step 'Execute shell' marked build as failure
Recording test results

Mime
View raw message