tez-dev mailing list archives

Site index · List index
Message view « Date » · « Thread »
Top « Date » · « Thread »
From Apache Jenkins Server <jenk...@builds.apache.org>
Subject Build failed in Jenkins: Tez-Build-Hadoop-2.4 #157
Date Sun, 23 Aug 2015 01:31:37 GMT
See <https://builds.apache.org/job/Tez-Build-Hadoop-2.4/157/changes>

Changes:

[sseth] TEZ-2019. Temporarily allow the scheduler and launcher to be specified

[sseth] TEZ-2006. Task communication plane needs to be pluggable. (sseth)

[sseth] TEZ-2090. Add tests for jobs running in external services. (sseth)

[sseth] TEZ-2117. Add a manager for ContainerLaunchers running in the AM.

[sseth] TEZ-2122. Setup pluggable components at AM/Vertex level. (sseth)

[sseth] TEZ-2123. Fix component managers to use pluggable components. Enable

[sseth] TEZ-2125. Create a task communicator for local mode. Allow tasks to run

[sseth] TEZ-2131. Add additional tests for tasks running in the AM. (sseth)

[sseth] TEZ-2138. Fix minor bugs in adding default scheduler, getting launchers.  (sseth)

[sseth] TEZ-2139. Update version to 0.7.0-TEZ-2003-SNAPSHOT. (sseth)

[sseth] TEZ-2175. Task priority should be available to the TaskCommunicator plugin. (sseth)

[sseth] TEZ-2187. Allow TaskCommunicators to report failed / killed attempts.  (sseth)

[sseth] TEZ-2241. Miscellaneous fixes after last reabse. (sseth)

[sseth] TEZ-2283. Fixes after rebase 04/07. (sseth)

[sseth] TEZ-2284. Separate TaskReporter into an interface. (sseth)

[sseth] TEZ-2285. Allow TaskCommunicators to indicate task/container liveness.  (sseth)

[sseth] TEZ-2302. Allow TaskCommunicators to subscribe for Vertex updates. (sseth)

[sseth] TEZ-2347. Expose additional information in TaskCommunicatorContext. (sseth)

[sseth] TEZ-2361. Propagate dag completion to TaskCommunicator. (sseth)

[sseth] TEZ-2381. Fixes after rebase 04/28. (sseth)

[sseth] TEZ-2388. Send dag identifier as part of the fetcher request string. (sseth)

[sseth] TEZ-2414. LogicalIOProcessorRuntimeTask, RuntimeTask, TezTaskRunner should handle
interrupts & carry out necessary cleanups. Contribtued by Rajesh Balamohan.

[sseth] TEZ-2420. TaskRunner returning before executing the task. (sseth)

[sseth] TEZ-2433. Fixes after rebase 05/08. (sseth)

[sseth] TEZ-2438. tez-tools version in the branch is incorrect. (sseth)

[sseth] TEZ-2434. Allow tasks to be killed in the runtime. (sseth)

[sseth] TEZ-2443. TaskRunner2 should call abort, NPEs while cleaning up tasks. (sseth)

[sseth] TEZ-2465. Retrun the status of a kill request in TaskRunner2. (sseth)

[sseth] TEZ-2471. NPE in LogicalIOProcessorRuntimeTask while printing thread info. (sseth)

[sseth] TEZ-2495. Inform TaskCommunicaor about Task and Container termination reasons. (sseth)

[sseth] TEZ-2502. Fix for TezTaskRunner2 not killing tasks properly in all situations. (sseth)

[sseth] TEZ-2508. rebase 06/01. (sseth)

[sseth] TEZ-2526. Fix version for tez-history-parser. Contributed by Sergey Shelukhin.

[sseth] TEZ-2621. rebase 07/14. (sseth)

[sseth] TEZ-2124. Change Node tracking to work per external container source. (sseth)

[sseth] TEZ-2004. Define basic interface for pluggable ContainerLaunchers. (sseth)

[sseth] TEZ-2005. Define basic interface for pluggable TaskScheduler. (sseth)

[sseth] TEZ-2651. Pluggable services should not extend AbstractService. (sseth)

[sseth] TEZ-2652. Cleanup the way services are specified for an AM and vertices. (sseth)

[sseth] TEZ-2653. Change service contexts to expose a user specified payload

[sseth] TEZ-2441. Add tests for TezTaskRunner2. (sseth)

[sseth] TEZ-2657. Add tests for client side changes - specifying plugins, etc. (sseth)

[sseth] TEZ-2626. Fix log lines with DEBUG in messages, consolidate TEZ-2003 TODOs. (sseth)

[sseth] TEZ-2126. Add unit tests for verifying multiple schedulers, launchers,

[sseth] TEZ-2698. rebase 08/05 (sseth)

[sseth] TEZ-2675. Add javadocs for new pluggable components, fix problems

[sseth] TEZ-2703. TEZ-2003 build fails (zjffdu)

[sseth] TEZ-2678. Fix comments from reviews - part 1. (sseth)

[sseth] TEZ-2707. Fix comments from reviews - part 2. (sseth)

[sseth] TEZ-2713. Add tests for node handling when there's multiple schedulers. (sseth)

[sseth] TEZ-2713 addendum. Fix CHANGES.txt

[sseth] TEZ-2721. rebase 08/14 (sseth)

[sseth] TEZ-2714. Fix comments from review - part 3. (sseth)

[sseth] TEZ-2727. Fix findbugs warnings. (sseth)

[sseth] TEZ-2670. Remove TaskAttempt holder used within TezTaskCommunicator. (sseth)

[sseth] TEZ-2735. rebase 08/21 (sseth)

[sseth] TEZ-2736. Pre-merge: Update CHANGES.txt and version in branch. (sseth)

------------------------------------------
[...truncated 968 lines...]
     'app/bower_components/ember-i18n/lib/i18n.js',
     'app/bower_components/ember-addons.bs_for_ember/dist/js/bs-core.min.js',
     'app/bower_components/ember-addons.bs_for_ember/dist/js/bs-basic.min.js',
     'app/bower_components/ember-addons.bs_for_ember/dist/js/bs-button.min.js',
     'app/bower_components/ember-addons.bs_for_ember/dist/js/bs-modal.min.js',
     'app/bower_components/ember-addons.bs_for_ember/dist/js/bs-nav.min.js',
     'app/bower_components/ember-addons.bs_for_ember/dist/js/bs-items-action-bar.min.js',
     'app/bower_components/ember-addons.bs_for_ember/dist/js/bs-badge.min.js',
     'app/bower_components/ember-addons.bs_for_ember/dist/js/bs-label.min.js',
     'app/bower_components/antiscroll/antiscroll.js',
     'app/bower_components/jquery-mousewheel/jquery.mousewheel.js',
     'app/bower_components/ember-table/dist/ember-table.js',
     'app/bower_components/ember-addons.bs_for_ember/dist/js/bs-nav.min.js',
     'app/bower_components/d3/d3.js',
     'app/bower_components/zip.js/WebContent/zip.js',
     'app/bower_components/FileSaver.js/FileSaver.min.js',
     'app/bower_components/codemirror/lib/codemirror.js',
     'app/bower_components/codemirror/mode/sql/sql.js',
     'app/bower_components/codemirror/mode/pig/pig.js' ],
  'dist/scripts/templates.js': [ '.tmp/scripts/compiled-templates.js'
],
  'dist/scripts/main.js': [ '.tmp/scripts/combined-scripts.js' ] }

  uglify:
  { 'dist/scripts/components.js': 'dist/scripts/components.js',
  'dist/scripts/templates.js': 'dist/scripts/templates.js',
  'dist/scripts/main.js': 'dist/scripts/main.js' }

  requirejs:
  {}

Running "concurrent:dist" (concurrent) task
    
    Running "htmlmin:dist" (htmlmin) task
    File dist/index.html created.
    
    Done, without errors.
        
    Running "svgmin:dist" (svgmin) task
    
    Done, without errors.
        
    Running "emberTemplates:dist" (emberTemplates) task
    File ".tmp/scripts/compiled-templates.js" created.
    
    Running "emberTemplates:development" (emberTemplates) task
    File ".tmp/scripts/compiled-templates.js" created.
    
    Done, without errors.
    
Running "neuter:app" (neuter) task

Running "less:production" (less) task
File .tmp/styles/styles.css created: 383.96 kB → 314.61 kB

Running "concat:dist/styles/main.css" (concat) task
File "dist/styles/main.css" created.

Running "concat:dist/scripts/components.js" (concat) task
File "dist/scripts/components.js" created.

Running "concat:dist/scripts/templates.js" (concat) task
File "dist/scripts/templates.js" created.

Running "concat:dist/scripts/main.js" (concat) task
File "dist/scripts/main.js" created.

Running "cssmin:dist" (cssmin) task
File dist/styles/main.css created.

Running "cssmin:dist/styles/main.css" (cssmin) task
File dist/styles/main.css created.

Running "copy:dist" (copy) task
Copied 27 files

Running "usemin:html" (usemin) task

Processing as HTML - dist/index.html
Update the HTML to reference our concat/min/revved script files
Update the HTML with the new css filenames
Update the HTML with the new img filenames
Update the HTML with data-main tags
Update the HTML with the data tags
Update the HTML with background imgs, case there is some inline style
Update the HTML with anchors images
Update the HTML with reference in input

Running "usemin:css" (usemin) task

Processing as CSS - dist/styles/main.css
Update the CSS with new img filenames

Done, without errors.
[INFO] 
[INFO] --- maven-resources-plugin:2.6:resources (default-resources) @ tez-ui ---
[INFO] Using 'UTF-8' encoding to copy filtered resources.
[INFO] Copying 2 resources
[INFO] 
[INFO] --- maven-compiler-plugin:3.1:compile (default-compile) @ tez-ui ---
[INFO] No sources to compile
[INFO] 
[INFO] --- maven-resources-plugin:2.6:testResources (default-testResources) @ tez-ui ---
[INFO] Using 'UTF-8' encoding to copy filtered resources.
[INFO] skip non existing resourceDirectory <https://builds.apache.org/job/Tez-Build-Hadoop-2.4/ws/tez-ui/src/test/resources>
[INFO] 
[INFO] --- maven-compiler-plugin:3.1:testCompile (default-testCompile) @ tez-ui ---
[INFO] No sources to compile
[INFO] 
[INFO] --- maven-surefire-plugin:2.14.1:test (default-test) @ tez-ui ---
[INFO] No tests to run.
[INFO]                                                                         
[INFO] ------------------------------------------------------------------------
[INFO] Building tez-plugins 0.8.0-SNAPSHOT
[INFO] ------------------------------------------------------------------------
[INFO] 
[INFO] --- maven-clean-plugin:2.5:clean (default-clean) @ tez-plugins ---
[INFO] 
[INFO] --- buildnumber-maven-plugin:1.1:create (default) @ tez-plugins ---
[INFO] Checking for local modifications: skipped.
[INFO] Updating project files from SCM: skipped.
[INFO] Executing: /bin/sh -c cd <https://builds.apache.org/job/Tez-Build-Hadoop-2.4/ws/tez-plugins>
&& git rev-parse --verify HEAD
[INFO] Working directory: <https://builds.apache.org/job/Tez-Build-Hadoop-2.4/ws/tez-plugins>
[INFO] Storing buildNumber: 2e62e98ec071a8fa3d41cad2c1aca04e3a26f22d at timestamp: 1440293553964
[INFO] Executing: /bin/sh -c cd <https://builds.apache.org/job/Tez-Build-Hadoop-2.4/ws/tez-plugins>
&& git rev-parse --verify HEAD
[INFO] Working directory: <https://builds.apache.org/job/Tez-Build-Hadoop-2.4/ws/tez-plugins>
[INFO] Storing buildScmBranch: UNKNOWN
[INFO] 
[INFO] --- build-helper-maven-plugin:1.8:maven-version (maven-version) @ tez-plugins ---
[INFO]                                                                         
[INFO] ------------------------------------------------------------------------
[INFO] Skipping tez-yarn-timeline-history
[INFO] This project has been banned from the build due to previous failures.
[INFO] ------------------------------------------------------------------------
[INFO]                                                                         
[INFO] ------------------------------------------------------------------------
[INFO] Skipping tez-history-parser
[INFO] This project has been banned from the build due to previous failures.
[INFO] ------------------------------------------------------------------------
[INFO]                                                                         
[INFO] ------------------------------------------------------------------------
[INFO] Skipping tez-mbeans-resource-calculator
[INFO] This project has been banned from the build due to previous failures.
[INFO] ------------------------------------------------------------------------
[INFO]                                                                         
[INFO] ------------------------------------------------------------------------
[INFO] Building tez-tools 0.8.0-SNAPSHOT
[INFO] ------------------------------------------------------------------------
[INFO] 
[INFO] --- maven-clean-plugin:2.5:clean (default-clean) @ tez-tools ---
[INFO] 
[INFO] --- buildnumber-maven-plugin:1.1:create (default) @ tez-tools ---
[INFO] Checking for local modifications: skipped.
[INFO] Updating project files from SCM: skipped.
[INFO] Executing: /bin/sh -c cd <https://builds.apache.org/job/Tez-Build-Hadoop-2.4/ws/tez-tools>
&& git rev-parse --verify HEAD
[INFO] Working directory: <https://builds.apache.org/job/Tez-Build-Hadoop-2.4/ws/tez-tools>
[INFO] Storing buildNumber: 2e62e98ec071a8fa3d41cad2c1aca04e3a26f22d at timestamp: 1440293553981
[INFO] Executing: /bin/sh -c cd <https://builds.apache.org/job/Tez-Build-Hadoop-2.4/ws/tez-tools>
&& git rev-parse --verify HEAD
[INFO] Working directory: <https://builds.apache.org/job/Tez-Build-Hadoop-2.4/ws/tez-tools>
[INFO] Storing buildScmBranch: UNKNOWN
[INFO] 
[INFO] --- build-helper-maven-plugin:1.8:maven-version (maven-version) @ tez-tools ---
[INFO]                                                                         
[INFO] ------------------------------------------------------------------------
[INFO] Building tez-perf-analyzer 0.8.0-SNAPSHOT
[INFO] ------------------------------------------------------------------------
[INFO] 
[INFO] --- maven-clean-plugin:2.5:clean (default-clean) @ tez-perf-analyzer ---
[INFO] 
[INFO] --- buildnumber-maven-plugin:1.1:create (default) @ tez-perf-analyzer ---
[INFO] Checking for local modifications: skipped.
[INFO] Updating project files from SCM: skipped.
[INFO] Executing: /bin/sh -c cd <https://builds.apache.org/job/Tez-Build-Hadoop-2.4/ws/tez-tools/analyzers>
&& git rev-parse --verify HEAD
[INFO] Working directory: <https://builds.apache.org/job/Tez-Build-Hadoop-2.4/ws/tez-tools/analyzers>
[INFO] Storing buildNumber: 2e62e98ec071a8fa3d41cad2c1aca04e3a26f22d at timestamp: 1440293553996
[INFO] Executing: /bin/sh -c cd <https://builds.apache.org/job/Tez-Build-Hadoop-2.4/ws/tez-tools/analyzers>
&& git rev-parse --verify HEAD
[INFO] Working directory: <https://builds.apache.org/job/Tez-Build-Hadoop-2.4/ws/tez-tools/analyzers>
[INFO] Storing buildScmBranch: UNKNOWN
[INFO] 
[INFO] --- build-helper-maven-plugin:1.8:maven-version (maven-version) @ tez-perf-analyzer
---
[INFO]                                                                         
[INFO] ------------------------------------------------------------------------
[INFO] Skipping tez-job-analyzer
[INFO] This project has been banned from the build due to previous failures.
[INFO] ------------------------------------------------------------------------
[INFO]                                                                         
[INFO] ------------------------------------------------------------------------
[INFO] Skipping tez-dist
[INFO] This project has been banned from the build due to previous failures.
[INFO] ------------------------------------------------------------------------
[INFO]                                                                         
[INFO] ------------------------------------------------------------------------
[INFO] Building Tez 0.8.0-SNAPSHOT
[INFO] ------------------------------------------------------------------------
[INFO] 
[INFO] --- maven-clean-plugin:2.5:clean (default-clean) @ tez-docs ---
[INFO] 
[INFO] --- buildnumber-maven-plugin:1.1:create (default) @ tez-docs ---
[INFO] Checking for local modifications: skipped.
[INFO] Updating project files from SCM: skipped.
[INFO] Executing: /bin/sh -c cd <https://builds.apache.org/job/Tez-Build-Hadoop-2.4/ws/docs>
&& git rev-parse --verify HEAD
[INFO] Working directory: <https://builds.apache.org/job/Tez-Build-Hadoop-2.4/ws/docs>
[INFO] Storing buildNumber: 2e62e98ec071a8fa3d41cad2c1aca04e3a26f22d at timestamp: 1440293554011
[INFO] Executing: /bin/sh -c cd <https://builds.apache.org/job/Tez-Build-Hadoop-2.4/ws/docs>
&& git rev-parse --verify HEAD
[INFO] Working directory: <https://builds.apache.org/job/Tez-Build-Hadoop-2.4/ws/docs>
[INFO] Storing buildScmBranch: UNKNOWN
[INFO] 
[INFO] --- build-helper-maven-plugin:1.8:maven-version (maven-version) @ tez-docs ---
[INFO] ------------------------------------------------------------------------
[INFO] Reactor Summary:
[INFO] 
[INFO] tez ............................................... SUCCESS [  2.047 s]
[INFO] tez-api ........................................... SUCCESS [ 43.051 s]
[INFO] tez-common ........................................ SUCCESS [  3.426 s]
[INFO] tez-runtime-internals ............................. SUCCESS [ 14.051 s]
[INFO] tez-runtime-library ............................... SUCCESS [02:14 min]
[INFO] tez-mapreduce ..................................... SUCCESS [ 29.460 s]
[INFO] tez-examples ...................................... SUCCESS [  0.226 s]
[INFO] tez-dag ........................................... FAILURE [17:07 min]
[INFO] tez-tests ......................................... SKIPPED
[INFO] tez-ext-service-tests ............................. SKIPPED
[INFO] tez-ui ............................................ SUCCESS [ 19.461 s]
[INFO] tez-plugins ....................................... SUCCESS [  0.015 s]
[INFO] tez-yarn-timeline-history ......................... SKIPPED
[INFO] tez-history-parser ................................ SKIPPED
[INFO] tez-mbeans-resource-calculator .................... SKIPPED
[INFO] tez-tools ......................................... SUCCESS [  0.015 s]
[INFO] tez-perf-analyzer ................................. SUCCESS [  0.015 s]
[INFO] tez-job-analyzer .................................. SKIPPED
[INFO] tez-dist .......................................... SKIPPED
[INFO] Tez ............................................... SUCCESS [  0.016 s]
[INFO] ------------------------------------------------------------------------
[INFO] BUILD FAILURE
[INFO] ------------------------------------------------------------------------
[INFO] Total time: 21:14 min
[INFO] Finished at: 2015-08-23T01:32:34+00:00
[INFO] Final Memory: 56M/751M
[INFO] ------------------------------------------------------------------------
[ERROR] Failed to execute goal org.apache.maven.plugins:maven-surefire-plugin:2.14.1:test
(default-test) on project tez-dag: There was a timeout or other error in the fork -> [Help
1]
[ERROR] 
[ERROR] To see the full stack trace of the errors, re-run Maven with the -e switch.
[ERROR] Re-run Maven using the -X switch to enable full debug logging.
[ERROR] 
[ERROR] For more information about the errors and possible solutions, please read the following
articles:
[ERROR] [Help 1] http://cwiki.apache.org/confluence/display/MAVEN/MojoFailureException
[ERROR] 
[ERROR] After correcting the problems, you can resume the build with the command
[ERROR]   mvn <goals> -rf :tez-dag
Build step 'Execute shell' marked build as failure
Recording test results

Mime
View raw message