tez-dev mailing list archives

Site index · List index
Message view « Date » · « Thread »
Top « Date » · « Thread »
From Apache Jenkins Server <jenk...@builds.apache.org>
Subject Build failed in Jenkins: Tez-Build-Hadoop-2.4 #160
Date Sat, 29 Aug 2015 01:29:26 GMT
See <https://builds.apache.org/job/Tez-Build-Hadoop-2.4/160/changes>

Changes:

[hitesh] TEZ-2662. Provide a way to check whether AM or task opts are valid and error if not.
(hitesh)

[hitesh] Remove TEZ-2662 from 0.7.1 as not committed to branch 0.7

[jeagles] TEZ-2300. TezClient.stop() takes a lot of time or does not work sometimes (jeagles)

[jeagles] TEZ-2300. TezClient.stop() takes a lot of time or does not work sometimes (jeagles)

[hitesh] Update CHANGES.txt for TEZ-2662. (hitesh)

[jeagles] TEZ-2300. fixup

[bikas] TEZ-2742. VertexImpl.finished() terminationCause hides member var of the same name
(bikas)

------------------------------------------
[...truncated 693 lines...]
     'app/bower_components/ember-addons.bs_for_ember/dist/js/bs-basic.min.js',
     'app/bower_components/ember-addons.bs_for_ember/dist/js/bs-button.min.js',
     'app/bower_components/ember-addons.bs_for_ember/dist/js/bs-modal.min.js',
     'app/bower_components/ember-addons.bs_for_ember/dist/js/bs-nav.min.js',
     'app/bower_components/ember-addons.bs_for_ember/dist/js/bs-items-action-bar.min.js',
     'app/bower_components/ember-addons.bs_for_ember/dist/js/bs-badge.min.js',
     'app/bower_components/ember-addons.bs_for_ember/dist/js/bs-label.min.js',
     'app/bower_components/antiscroll/antiscroll.js',
     'app/bower_components/jquery-mousewheel/jquery.mousewheel.js',
     'app/bower_components/ember-table/dist/ember-table.js',
     'app/bower_components/ember-addons.bs_for_ember/dist/js/bs-nav.min.js',
     'app/bower_components/d3/d3.js',
     'app/bower_components/zip.js/WebContent/zip.js',
     'app/bower_components/FileSaver.js/FileSaver.min.js',
     'app/bower_components/codemirror/lib/codemirror.js',
     'app/bower_components/codemirror/mode/sql/sql.js',
     'app/bower_components/codemirror/mode/pig/pig.js' ],
  'dist/scripts/templates.js': [ '.tmp/scripts/compiled-templates.js'
],
  'dist/scripts/main.js': [ '.tmp/scripts/combined-scripts.js' ] }

  uglify:
  { 'dist/scripts/components.js': 'dist/scripts/components.js',
  'dist/scripts/templates.js': 'dist/scripts/templates.js',
  'dist/scripts/main.js': 'dist/scripts/main.js' }

  requirejs:
  {}

Running "concurrent:dist" (concurrent) task
    
    Running "htmlmin:dist" (htmlmin) task
    File dist/index.html created.
    
    Done, without errors.
        
    Running "svgmin:dist" (svgmin) task
    
    Done, without errors.
        
    Running "emberTemplates:dist" (emberTemplates) task
    File ".tmp/scripts/compiled-templates.js" created.
    
    Running "emberTemplates:development" (emberTemplates) task
    File ".tmp/scripts/compiled-templates.js" created.
    
    Done, without errors.
    
Running "neuter:app" (neuter) task

Running "less:production" (less) task
File .tmp/styles/styles.css created: 383.96 kB → 314.61 kB

Running "concat:dist/styles/main.css" (concat) task
File "dist/styles/main.css" created.

Running "concat:dist/scripts/components.js" (concat) task
File "dist/scripts/components.js" created.

Running "concat:dist/scripts/templates.js" (concat) task
File "dist/scripts/templates.js" created.

Running "concat:dist/scripts/main.js" (concat) task
File "dist/scripts/main.js" created.

Running "cssmin:dist" (cssmin) task
File dist/styles/main.css created.

Running "cssmin:dist/styles/main.css" (cssmin) task
File dist/styles/main.css created.

Running "copy:dist" (copy) task
Copied 27 files

Running "usemin:html" (usemin) task

Processing as HTML - dist/index.html
Update the HTML to reference our concat/min/revved script files
Update the HTML with the new css filenames
Update the HTML with the new img filenames
Update the HTML with data-main tags
Update the HTML with the data tags
Update the HTML with background imgs, case there is some inline style
Update the HTML with anchors images
Update the HTML with reference in input

Running "usemin:css" (usemin) task

Processing as CSS - dist/styles/main.css
Update the CSS with new img filenames

Done, without errors.
[INFO] 
[INFO] --- maven-resources-plugin:2.6:resources (default-resources) @ tez-ui ---
[INFO] Using 'UTF-8' encoding to copy filtered resources.
[INFO] Copying 2 resources
[INFO] 
[INFO] --- maven-compiler-plugin:3.1:compile (default-compile) @ tez-ui ---
[INFO] No sources to compile
[INFO] 
[INFO] --- maven-resources-plugin:2.6:testResources (default-testResources) @ tez-ui ---
[INFO] Using 'UTF-8' encoding to copy filtered resources.
[INFO] skip non existing resourceDirectory <https://builds.apache.org/job/Tez-Build-Hadoop-2.4/ws/tez-ui/src/test/resources>
[INFO] 
[INFO] --- maven-compiler-plugin:3.1:testCompile (default-testCompile) @ tez-ui ---
[INFO] No sources to compile
[INFO] 
[INFO] --- maven-surefire-plugin:2.14.1:test (default-test) @ tez-ui ---
[INFO] No tests to run.
[INFO]                                                                         
[INFO] ------------------------------------------------------------------------
[INFO] Building tez-plugins 0.8.1-SNAPSHOT
[INFO] ------------------------------------------------------------------------
[INFO] 
[INFO] --- maven-clean-plugin:2.5:clean (default-clean) @ tez-plugins ---
[INFO] 
[INFO] --- buildnumber-maven-plugin:1.1:create (default) @ tez-plugins ---
[INFO] Checking for local modifications: skipped.
[INFO] Updating project files from SCM: skipped.
[INFO] Executing: /bin/sh -c cd <https://builds.apache.org/job/Tez-Build-Hadoop-2.4/ws/tez-plugins>
&& git rev-parse --verify HEAD
[INFO] Working directory: <https://builds.apache.org/job/Tez-Build-Hadoop-2.4/ws/tez-plugins>
[INFO] Storing buildNumber: e5a79fd44edbd2376a9c0308a9c9f075cb7d9d25 at timestamp: 1440811831956
[INFO] Executing: /bin/sh -c cd <https://builds.apache.org/job/Tez-Build-Hadoop-2.4/ws/tez-plugins>
&& git rev-parse --verify HEAD
[INFO] Working directory: <https://builds.apache.org/job/Tez-Build-Hadoop-2.4/ws/tez-plugins>
[INFO] Storing buildScmBranch: UNKNOWN
[INFO] 
[INFO] --- build-helper-maven-plugin:1.8:maven-version (maven-version) @ tez-plugins ---
[INFO]                                                                         
[INFO] ------------------------------------------------------------------------
[INFO] Skipping tez-yarn-timeline-history
[INFO] This project has been banned from the build due to previous failures.
[INFO] ------------------------------------------------------------------------
[INFO]                                                                         
[INFO] ------------------------------------------------------------------------
[INFO] Skipping tez-history-parser
[INFO] This project has been banned from the build due to previous failures.
[INFO] ------------------------------------------------------------------------
[INFO]                                                                         
[INFO] ------------------------------------------------------------------------
[INFO] Skipping tez-mbeans-resource-calculator
[INFO] This project has been banned from the build due to previous failures.
[INFO] ------------------------------------------------------------------------
[INFO]                                                                         
[INFO] ------------------------------------------------------------------------
[INFO] Building tez-tools 0.8.1-SNAPSHOT
[INFO] ------------------------------------------------------------------------
[INFO] 
[INFO] --- maven-clean-plugin:2.5:clean (default-clean) @ tez-tools ---
[INFO] 
[INFO] --- buildnumber-maven-plugin:1.1:create (default) @ tez-tools ---
[INFO] Checking for local modifications: skipped.
[INFO] Updating project files from SCM: skipped.
[INFO] Executing: /bin/sh -c cd <https://builds.apache.org/job/Tez-Build-Hadoop-2.4/ws/tez-tools>
&& git rev-parse --verify HEAD
[INFO] Working directory: <https://builds.apache.org/job/Tez-Build-Hadoop-2.4/ws/tez-tools>
[INFO] Storing buildNumber: e5a79fd44edbd2376a9c0308a9c9f075cb7d9d25 at timestamp: 1440811831973
[INFO] Executing: /bin/sh -c cd <https://builds.apache.org/job/Tez-Build-Hadoop-2.4/ws/tez-tools>
&& git rev-parse --verify HEAD
[INFO] Working directory: <https://builds.apache.org/job/Tez-Build-Hadoop-2.4/ws/tez-tools>
[INFO] Storing buildScmBranch: UNKNOWN
[INFO] 
[INFO] --- build-helper-maven-plugin:1.8:maven-version (maven-version) @ tez-tools ---
[INFO]                                                                         
[INFO] ------------------------------------------------------------------------
[INFO] Building tez-perf-analyzer 0.8.1-SNAPSHOT
[INFO] ------------------------------------------------------------------------
[INFO] 
[INFO] --- maven-clean-plugin:2.5:clean (default-clean) @ tez-perf-analyzer ---
[INFO] 
[INFO] --- buildnumber-maven-plugin:1.1:create (default) @ tez-perf-analyzer ---
[INFO] Checking for local modifications: skipped.
[INFO] Updating project files from SCM: skipped.
[INFO] Executing: /bin/sh -c cd <https://builds.apache.org/job/Tez-Build-Hadoop-2.4/ws/tez-tools/analyzers>
&& git rev-parse --verify HEAD
[INFO] Working directory: <https://builds.apache.org/job/Tez-Build-Hadoop-2.4/ws/tez-tools/analyzers>
[INFO] Storing buildNumber: e5a79fd44edbd2376a9c0308a9c9f075cb7d9d25 at timestamp: 1440811831989
[INFO] Executing: /bin/sh -c cd <https://builds.apache.org/job/Tez-Build-Hadoop-2.4/ws/tez-tools/analyzers>
&& git rev-parse --verify HEAD
[INFO] Working directory: <https://builds.apache.org/job/Tez-Build-Hadoop-2.4/ws/tez-tools/analyzers>
[INFO] Storing buildScmBranch: UNKNOWN
[INFO] 
[INFO] --- build-helper-maven-plugin:1.8:maven-version (maven-version) @ tez-perf-analyzer
---
[INFO]                                                                         
[INFO] ------------------------------------------------------------------------
[INFO] Skipping tez-job-analyzer
[INFO] This project has been banned from the build due to previous failures.
[INFO] ------------------------------------------------------------------------
[INFO]                                                                         
[INFO] ------------------------------------------------------------------------
[INFO] Skipping tez-dist
[INFO] This project has been banned from the build due to previous failures.
[INFO] ------------------------------------------------------------------------
[INFO]                                                                         
[INFO] ------------------------------------------------------------------------
[INFO] Building Tez 0.8.1-SNAPSHOT
[INFO] ------------------------------------------------------------------------
[INFO] 
[INFO] --- maven-clean-plugin:2.5:clean (default-clean) @ tez-docs ---
[INFO] 
[INFO] --- buildnumber-maven-plugin:1.1:create (default) @ tez-docs ---
[INFO] Checking for local modifications: skipped.
[INFO] Updating project files from SCM: skipped.
[INFO] Executing: /bin/sh -c cd <https://builds.apache.org/job/Tez-Build-Hadoop-2.4/ws/docs>
&& git rev-parse --verify HEAD
[INFO] Working directory: <https://builds.apache.org/job/Tez-Build-Hadoop-2.4/ws/docs>
[INFO] Storing buildNumber: e5a79fd44edbd2376a9c0308a9c9f075cb7d9d25 at timestamp: 1440811832005
[INFO] Executing: /bin/sh -c cd <https://builds.apache.org/job/Tez-Build-Hadoop-2.4/ws/docs>
&& git rev-parse --verify HEAD
[INFO] Working directory: <https://builds.apache.org/job/Tez-Build-Hadoop-2.4/ws/docs>
[INFO] Storing buildScmBranch: UNKNOWN
[INFO] 
[INFO] --- build-helper-maven-plugin:1.8:maven-version (maven-version) @ tez-docs ---
[INFO] ------------------------------------------------------------------------
[INFO] Reactor Summary:
[INFO] 
[INFO] tez ............................................... SUCCESS [  1.424 s]
[INFO] tez-api ........................................... SUCCESS [ 44.173 s]
[INFO] tez-common ........................................ SUCCESS [  3.391 s]
[INFO] tez-runtime-internals ............................. SUCCESS [ 12.480 s]
[INFO] tez-runtime-library ............................... FAILURE [02:08 min]
[INFO] tez-mapreduce ..................................... SKIPPED
[INFO] tez-examples ...................................... SKIPPED
[INFO] tez-dag ........................................... SKIPPED
[INFO] tez-tests ......................................... SKIPPED
[INFO] tez-ext-service-tests ............................. SKIPPED
[INFO] tez-ui ............................................ SUCCESS [ 16.886 s]
[INFO] tez-plugins ....................................... SUCCESS [  0.015 s]
[INFO] tez-yarn-timeline-history ......................... SKIPPED
[INFO] tez-history-parser ................................ SKIPPED
[INFO] tez-mbeans-resource-calculator .................... SKIPPED
[INFO] tez-tools ......................................... SUCCESS [  0.016 s]
[INFO] tez-perf-analyzer ................................. SUCCESS [  0.016 s]
[INFO] tez-job-analyzer .................................. SKIPPED
[INFO] tez-dist .......................................... SKIPPED
[INFO] Tez ............................................... SUCCESS [  0.015 s]
[INFO] ------------------------------------------------------------------------
[INFO] BUILD FAILURE
[INFO] ------------------------------------------------------------------------
[INFO] Total time: 03:27 min
[INFO] Finished at: 2015-08-29T01:30:32+00:00
[INFO] Final Memory: 42M/737M
[INFO] ------------------------------------------------------------------------
[ERROR] Failed to execute goal org.apache.maven.plugins:maven-surefire-plugin:2.14.1:test
(default-test) on project tez-runtime-library: ExecutionException; nested exception is java.util.concurrent.ExecutionException:
java.lang.RuntimeException: The forked VM terminated without saying properly goodbye. VM crash
or System.exit called ?
[ERROR] Command was/bin/sh -c cd <https://builds.apache.org/job/Tez-Build-Hadoop-2.4/ws/tez-runtime-library>
&& /home/jenkins/tools/java/jdk1.7.0_55/jre/bin/java -Xmx1024m -XX:+HeapDumpOnOutOfMemoryError
-jar <https://builds.apache.org/job/Tez-Build-Hadoop-2.4/ws/tez-runtime-library/target/surefire/surefirebooter466727257697376816.jar>
<https://builds.apache.org/job/Tez-Build-Hadoop-2.4/ws/tez-runtime-library/target/surefire/surefire1274439286453274460tmp>
<https://builds.apache.org/job/Tez-Build-Hadoop-2.4/ws/tez-runtime-library/target/surefire/surefire_511582068341567882476tmp>
[ERROR] -> [Help 1]
[ERROR] 
[ERROR] To see the full stack trace of the errors, re-run Maven with the -e switch.
[ERROR] Re-run Maven using the -X switch to enable full debug logging.
[ERROR] 
[ERROR] For more information about the errors and possible solutions, please read the following
articles:
[ERROR] [Help 1] http://cwiki.apache.org/confluence/display/MAVEN/MojoFailureException
[ERROR] 
[ERROR] After correcting the problems, you can resume the build with the command
[ERROR]   mvn <goals> -rf :tez-runtime-library
Build step 'Execute shell' marked build as failure
Recording test results

Mime
View raw message