tez-dev mailing list archives

Site index · List index
Message view « Date » · « Thread »
Top « Date » · « Thread »
From Apache Jenkins Server <jenk...@builds.apache.org>
Subject Build failed in Jenkins: Tez-Build-Hadoop-2.2 #162
Date Wed, 02 Sep 2015 00:32:41 GMT
See <https://builds.apache.org/job/Tez-Build-Hadoop-2.2/162/changes>

Changes:

[sseth] TEZ-2762. Changes for 0.8.0-alpha release. (sseth)

[hitesh] TEZ-2294. Add tez-site-template.xml with description of config properties. (hitesh)

[sseth] TEZ-2750. Shuffle may not shutdown in case of a fetch failure, causing it to hang.
(sseth)

------------------------------------------
[...truncated 729 lines...]
  uglify:
  { 'dist/scripts/components.js': 'dist/scripts/components.js',
  'dist/scripts/templates.js': 'dist/scripts/templates.js',
  'dist/scripts/main.js': 'dist/scripts/main.js' }

  requirejs:
  {}

Running "concurrent:dist" (concurrent) task
    
    Running "htmlmin:dist" (htmlmin) task
    File dist/index.html created.
    
    Done, without errors.
        
    Running "svgmin:dist" (svgmin) task
    
    Done, without errors.
        
    Running "emberTemplates:dist" (emberTemplates) task
    File ".tmp/scripts/compiled-templates.js" created.
    
    Running "emberTemplates:development" (emberTemplates) task
    File ".tmp/scripts/compiled-templates.js" created.
    
    Done, without errors.
    
Running "neuter:app" (neuter) task

Running "less:production" (less) task
File .tmp/styles/styles.css created: 383.96 kB → 314.61 kB

Running "concat:dist/styles/main.css" (concat) task
File "dist/styles/main.css" created.

Running "concat:dist/scripts/components.js" (concat) task
File "dist/scripts/components.js" created.

Running "concat:dist/scripts/templates.js" (concat) task
File "dist/scripts/templates.js" created.

Running "concat:dist/scripts/main.js" (concat) task
File "dist/scripts/main.js" created.

Running "cssmin:dist" (cssmin) task
File dist/styles/main.css created.

Running "cssmin:dist/styles/main.css" (cssmin) task
File dist/styles/main.css created.

Running "copy:dist" (copy) task
Copied 27 files

Running "usemin:html" (usemin) task

Processing as HTML - dist/index.html
Update the HTML to reference our concat/min/revved script files
Update the HTML with the new css filenames
Update the HTML with the new img filenames
Update the HTML with data-main tags
Update the HTML with the data tags
Update the HTML with background imgs, case there is some inline style
Update the HTML with anchors images
Update the HTML with reference in input

Running "usemin:css" (usemin) task

Processing as CSS - dist/styles/main.css
Update the CSS with new img filenames

Done, without errors.
[INFO] 
[INFO] --- maven-resources-plugin:2.6:resources (default-resources) @ tez-ui ---
[INFO] Using 'UTF-8' encoding to copy filtered resources.
[INFO] Copying 2 resources
[INFO] 
[INFO] --- maven-compiler-plugin:3.1:compile (default-compile) @ tez-ui ---
[INFO] No sources to compile
[INFO] 
[INFO] --- maven-resources-plugin:2.6:testResources (default-testResources) @ tez-ui ---
[INFO] Using 'UTF-8' encoding to copy filtered resources.
[INFO] skip non existing resourceDirectory <https://builds.apache.org/job/Tez-Build-Hadoop-2.2/ws/tez-ui/src/test/resources>
[INFO] 
[INFO] --- maven-compiler-plugin:3.1:testCompile (default-testCompile) @ tez-ui ---
[INFO] No sources to compile
[INFO] 
[INFO] --- maven-surefire-plugin:2.14.1:test (default-test) @ tez-ui ---
[INFO] No tests to run.
[INFO]                                                                         
[INFO] ------------------------------------------------------------------------
[INFO] Building tez-plugins 0.8.1-SNAPSHOT
[INFO] ------------------------------------------------------------------------
[INFO] 
[INFO] --- maven-clean-plugin:2.5:clean (default-clean) @ tez-plugins ---
[INFO] 
[INFO] --- buildnumber-maven-plugin:1.1:create (default) @ tez-plugins ---
[INFO] Checking for local modifications: skipped.
[INFO] Updating project files from SCM: skipped.
[INFO] Executing: /bin/sh -c cd <https://builds.apache.org/job/Tez-Build-Hadoop-2.2/ws/tez-plugins>
&& git rev-parse --verify HEAD
[INFO] Working directory: <https://builds.apache.org/job/Tez-Build-Hadoop-2.2/ws/tez-plugins>
[INFO] Storing buildNumber: 49866b8fca8b71be9d1edb011599177d610bc0c3 at timestamp: 1441154031646
[INFO] Executing: /bin/sh -c cd <https://builds.apache.org/job/Tez-Build-Hadoop-2.2/ws/tez-plugins>
&& git rev-parse --verify HEAD
[INFO] Working directory: <https://builds.apache.org/job/Tez-Build-Hadoop-2.2/ws/tez-plugins>
[INFO] Storing buildScmBranch: UNKNOWN
[INFO] 
[INFO] --- build-helper-maven-plugin:1.8:maven-version (maven-version) @ tez-plugins ---
[INFO]                                                                         
[INFO] ------------------------------------------------------------------------
[INFO] Skipping tez-mbeans-resource-calculator
[INFO] This project has been banned from the build due to previous failures.
[INFO] ------------------------------------------------------------------------
[INFO]                                                                         
[INFO] ------------------------------------------------------------------------
[INFO] Building tez-tools 0.8.1-SNAPSHOT
[INFO] ------------------------------------------------------------------------
[INFO] 
[INFO] --- maven-clean-plugin:2.5:clean (default-clean) @ tez-tools ---
[INFO] 
[INFO] --- buildnumber-maven-plugin:1.1:create (default) @ tez-tools ---
[INFO] Checking for local modifications: skipped.
[INFO] Updating project files from SCM: skipped.
[INFO] Executing: /bin/sh -c cd <https://builds.apache.org/job/Tez-Build-Hadoop-2.2/ws/tez-tools>
&& git rev-parse --verify HEAD
[INFO] Working directory: <https://builds.apache.org/job/Tez-Build-Hadoop-2.2/ws/tez-tools>
[INFO] Storing buildNumber: 49866b8fca8b71be9d1edb011599177d610bc0c3 at timestamp: 1441154031663
[INFO] Executing: /bin/sh -c cd <https://builds.apache.org/job/Tez-Build-Hadoop-2.2/ws/tez-tools>
&& git rev-parse --verify HEAD
[INFO] Working directory: <https://builds.apache.org/job/Tez-Build-Hadoop-2.2/ws/tez-tools>
[INFO] Storing buildScmBranch: UNKNOWN
[INFO] 
[INFO] --- build-helper-maven-plugin:1.8:maven-version (maven-version) @ tez-tools ---
[INFO]                                                                         
[INFO] ------------------------------------------------------------------------
[INFO] Building tez-perf-analyzer 0.8.1-SNAPSHOT
[INFO] ------------------------------------------------------------------------
[INFO] 
[INFO] --- maven-clean-plugin:2.5:clean (default-clean) @ tez-perf-analyzer ---
[INFO] 
[INFO] --- buildnumber-maven-plugin:1.1:create (default) @ tez-perf-analyzer ---
[INFO] Checking for local modifications: skipped.
[INFO] Updating project files from SCM: skipped.
[INFO] Executing: /bin/sh -c cd <https://builds.apache.org/job/Tez-Build-Hadoop-2.2/ws/tez-tools/analyzers>
&& git rev-parse --verify HEAD
[INFO] Working directory: <https://builds.apache.org/job/Tez-Build-Hadoop-2.2/ws/tez-tools/analyzers>
[INFO] Storing buildNumber: 49866b8fca8b71be9d1edb011599177d610bc0c3 at timestamp: 1441154031675
[INFO] Executing: /bin/sh -c cd <https://builds.apache.org/job/Tez-Build-Hadoop-2.2/ws/tez-tools/analyzers>
&& git rev-parse --verify HEAD
[INFO] Working directory: <https://builds.apache.org/job/Tez-Build-Hadoop-2.2/ws/tez-tools/analyzers>
[INFO] Storing buildScmBranch: UNKNOWN
[INFO] 
[INFO] --- build-helper-maven-plugin:1.8:maven-version (maven-version) @ tez-perf-analyzer
---
[INFO]                                                                         
[INFO] ------------------------------------------------------------------------
[INFO] Building tez-javadoc-tools 0.8.1-SNAPSHOT
[INFO] ------------------------------------------------------------------------
[INFO] 
[INFO] --- maven-clean-plugin:2.5:clean (default-clean) @ tez-javadoc-tools ---
[INFO] 
[INFO] --- buildnumber-maven-plugin:1.1:create (default) @ tez-javadoc-tools ---
[INFO] Checking for local modifications: skipped.
[INFO] Updating project files from SCM: skipped.
[INFO] Executing: /bin/sh -c cd <https://builds.apache.org/job/Tez-Build-Hadoop-2.2/ws/tez-tools/tez-javadoc-tools>
&& git rev-parse --verify HEAD
[INFO] Working directory: <https://builds.apache.org/job/Tez-Build-Hadoop-2.2/ws/tez-tools/tez-javadoc-tools>
[INFO] Storing buildNumber: 49866b8fca8b71be9d1edb011599177d610bc0c3 at timestamp: 1441154031739
[INFO] Executing: /bin/sh -c cd <https://builds.apache.org/job/Tez-Build-Hadoop-2.2/ws/tez-tools/tez-javadoc-tools>
&& git rev-parse --verify HEAD
[INFO] Working directory: <https://builds.apache.org/job/Tez-Build-Hadoop-2.2/ws/tez-tools/tez-javadoc-tools>
[INFO] Storing buildScmBranch: UNKNOWN
[INFO] 
[INFO] --- build-helper-maven-plugin:1.8:maven-version (maven-version) @ tez-javadoc-tools
---
[INFO] 
[INFO] --- maven-resources-plugin:2.6:resources (default-resources) @ tez-javadoc-tools ---
[INFO] Using 'UTF-8' encoding to copy filtered resources.
[INFO] skip non existing resourceDirectory <https://builds.apache.org/job/Tez-Build-Hadoop-2.2/ws/tez-tools/tez-javadoc-tools/src/main/resources>
[INFO] 
[INFO] --- maven-compiler-plugin:3.1:compile (default-compile) @ tez-javadoc-tools ---
[INFO] Changes detected - recompiling the module!
[INFO] Compiling 6 source files to <https://builds.apache.org/job/Tez-Build-Hadoop-2.2/ws/tez-tools/tez-javadoc-tools/target/classes>
[INFO] 
[INFO] --- maven-resources-plugin:2.6:testResources (default-testResources) @ tez-javadoc-tools
---
[INFO] Using 'UTF-8' encoding to copy filtered resources.
[INFO] skip non existing resourceDirectory <https://builds.apache.org/job/Tez-Build-Hadoop-2.2/ws/tez-tools/tez-javadoc-tools/src/test/resources>
[INFO] 
[INFO] --- maven-compiler-plugin:3.1:testCompile (default-testCompile) @ tez-javadoc-tools
---
[INFO] No sources to compile
[INFO] 
[INFO] --- maven-surefire-plugin:2.14.1:test (default-test) @ tez-javadoc-tools ---
[INFO] No tests to run.
[INFO]                                                                         
[INFO] ------------------------------------------------------------------------
[INFO] Skipping tez-dist
[INFO] This project has been banned from the build due to previous failures.
[INFO] ------------------------------------------------------------------------
[INFO]                                                                         
[INFO] ------------------------------------------------------------------------
[INFO] Building Tez 0.8.1-SNAPSHOT
[INFO] ------------------------------------------------------------------------
[INFO] 
[INFO] --- maven-clean-plugin:2.5:clean (default-clean) @ tez-docs ---
[INFO] 
[INFO] --- buildnumber-maven-plugin:1.1:create (default) @ tez-docs ---
[INFO] Checking for local modifications: skipped.
[INFO] Updating project files from SCM: skipped.
[INFO] Executing: /bin/sh -c cd <https://builds.apache.org/job/Tez-Build-Hadoop-2.2/ws/docs>
&& git rev-parse --verify HEAD
[INFO] Working directory: <https://builds.apache.org/job/Tez-Build-Hadoop-2.2/ws/docs>
[INFO] Storing buildNumber: 49866b8fca8b71be9d1edb011599177d610bc0c3 at timestamp: 1441154031830
[INFO] Executing: /bin/sh -c cd <https://builds.apache.org/job/Tez-Build-Hadoop-2.2/ws/docs>
&& git rev-parse --verify HEAD
[INFO] Working directory: <https://builds.apache.org/job/Tez-Build-Hadoop-2.2/ws/docs>
[INFO] Storing buildScmBranch: UNKNOWN
[INFO] 
[INFO] --- build-helper-maven-plugin:1.8:maven-version (maven-version) @ tez-docs ---
[INFO] ------------------------------------------------------------------------
[INFO] Reactor Summary:
[INFO] 
[INFO] tez ............................................... SUCCESS [  1.181 s]
[INFO] tez-api ........................................... SUCCESS [ 40.941 s]
[INFO] tez-common ........................................ SUCCESS [  3.408 s]
[INFO] tez-runtime-internals ............................. SUCCESS [ 12.740 s]
[INFO] tez-runtime-library ............................... FAILURE [02:08 min]
[INFO] tez-mapreduce ..................................... SKIPPED
[INFO] tez-examples ...................................... SKIPPED
[INFO] tez-dag ........................................... SKIPPED
[INFO] tez-tests ......................................... SKIPPED
[INFO] tez-ext-service-tests ............................. SKIPPED
[INFO] tez-ui ............................................ SUCCESS [ 17.020 s]
[INFO] tez-plugins ....................................... SUCCESS [  0.016 s]
[INFO] tez-mbeans-resource-calculator .................... SKIPPED
[INFO] tez-tools ......................................... SUCCESS [  0.014 s]
[INFO] tez-perf-analyzer ................................. SUCCESS [  0.014 s]
[INFO] tez-javadoc-tools ................................. SUCCESS [  0.141 s]
[INFO] tez-dist .......................................... SKIPPED
[INFO] Tez ............................................... SUCCESS [  0.013 s]
[INFO] ------------------------------------------------------------------------
[INFO] BUILD FAILURE
[INFO] ------------------------------------------------------------------------
[INFO] Total time: 03:24 min
[INFO] Finished at: 2015-09-02T00:33:51+00:00
[INFO] Final Memory: 42M/737M
[INFO] ------------------------------------------------------------------------
[ERROR] Failed to execute goal org.apache.maven.plugins:maven-surefire-plugin:2.14.1:test
(default-test) on project tez-runtime-library: There are test failures.
[ERROR] 
[ERROR] Please refer to <https://builds.apache.org/job/Tez-Build-Hadoop-2.2/ws/tez-runtime-library/target/surefire-reports>
for the individual test results.
[ERROR] -> [Help 1]
[ERROR] 
[ERROR] To see the full stack trace of the errors, re-run Maven with the -e switch.
[ERROR] Re-run Maven using the -X switch to enable full debug logging.
[ERROR] 
[ERROR] For more information about the errors and possible solutions, please read the following
articles:
[ERROR] [Help 1] http://cwiki.apache.org/confluence/display/MAVEN/MojoFailureException
[ERROR] 
[ERROR] After correcting the problems, you can resume the build with the command
[ERROR]   mvn <goals> -rf :tez-runtime-library
Build step 'Execute shell' marked build as failure
Recording test results

Mime
View raw message