tez-dev mailing list archives

Site index · List index
Message view « Date » · « Thread »
Top « Date » · « Thread »
From Apache Jenkins Server <jenk...@builds.apache.org>
Subject Build failed in Jenkins: Tez-Build-Hadoop-2.4 #171
Date Tue, 15 Sep 2015 04:20:39 GMT
See <https://builds.apache.org/job/Tez-Build-Hadoop-2.4/171/changes>

Changes:

[pramachandran] TEZ-2813. Tez UI: add counter data for rest api calls to AM Web Services v2
(sree via pramachandran)

[pramachandran] TEZ-2817. Tez UI: update in progress counter data for the dag vertices and
tasks table (sree via pramachandran)

[hitesh] TEZ-2876. Tez UI: Update vertex, task & attempt details page while in progress.
(Sreenath Somarajapuram via hitesh)

[hitesh] TEZ-2812. Tez UI: Update task & attempt tables while in progress. (Sreenath Somarajapuram
via hitesh)

------------------------------------------
[...truncated 1304 lines...]
[INFO] 
[INFO] --- maven-compiler-plugin:3.1:testCompile (default-testCompile) @ tez-history-parser
---
[INFO] Changes detected - recompiling the module!
[INFO] Compiling 1 source file to <https://builds.apache.org/job/Tez-Build-Hadoop-2.4/ws/tez-plugins/tez-history-parser/target/test-classes>
[INFO] 
[INFO] --- maven-surefire-plugin:2.14.1:test (default-test) @ tez-history-parser ---
[INFO] Surefire report directory: <https://builds.apache.org/job/Tez-Build-Hadoop-2.4/ws/tez-plugins/tez-history-parser/target/surefire-reports>

-------------------------------------------------------
 T E S T S
-------------------------------------------------------

-------------------------------------------------------
 T E S T S
-------------------------------------------------------
Running org.apache.tez.history.TestHistoryParser
Tests run: 3, Failures: 0, Errors: 0, Skipped: 0, Time elapsed: 105.338 sec

Results :

Tests run: 3, Failures: 0, Errors: 0, Skipped: 0

[INFO]                                                                         
[INFO] ------------------------------------------------------------------------
[INFO] Building tez-tools 0.8.1-SNAPSHOT
[INFO] ------------------------------------------------------------------------
[INFO] 
[INFO] --- maven-clean-plugin:2.5:clean (default-clean) @ tez-tools ---
[INFO] 
[INFO] --- buildnumber-maven-plugin:1.1:create (default) @ tez-tools ---
[INFO] Checking for local modifications: skipped.
[INFO] Updating project files from SCM: skipped.
[INFO] Executing: /bin/sh -c cd <https://builds.apache.org/job/Tez-Build-Hadoop-2.4/ws/tez-tools>
&& git rev-parse --verify HEAD
[INFO] Working directory: <https://builds.apache.org/job/Tez-Build-Hadoop-2.4/ws/tez-tools>
[INFO] Storing buildNumber: ffa3d5208dcd37f990273799d1dd60176e303568 at timestamp: 1442290738181
[INFO] Executing: /bin/sh -c cd <https://builds.apache.org/job/Tez-Build-Hadoop-2.4/ws/tez-tools>
&& git rev-parse --verify HEAD
[INFO] Working directory: <https://builds.apache.org/job/Tez-Build-Hadoop-2.4/ws/tez-tools>
[INFO] Storing buildScmBranch: UNKNOWN
[INFO] 
[INFO] --- build-helper-maven-plugin:1.8:maven-version (maven-version) @ tez-tools ---
[INFO]                                                                         
[INFO] ------------------------------------------------------------------------
[INFO] Building tez-perf-analyzer 0.8.1-SNAPSHOT
[INFO] ------------------------------------------------------------------------
[INFO] 
[INFO] --- maven-clean-plugin:2.5:clean (default-clean) @ tez-perf-analyzer ---
[INFO] 
[INFO] --- buildnumber-maven-plugin:1.1:create (default) @ tez-perf-analyzer ---
[INFO] Checking for local modifications: skipped.
[INFO] Updating project files from SCM: skipped.
[INFO] Executing: /bin/sh -c cd <https://builds.apache.org/job/Tez-Build-Hadoop-2.4/ws/tez-tools/analyzers>
&& git rev-parse --verify HEAD
[INFO] Working directory: <https://builds.apache.org/job/Tez-Build-Hadoop-2.4/ws/tez-tools/analyzers>
[INFO] Storing buildNumber: ffa3d5208dcd37f990273799d1dd60176e303568 at timestamp: 1442290738199
[INFO] Executing: /bin/sh -c cd <https://builds.apache.org/job/Tez-Build-Hadoop-2.4/ws/tez-tools/analyzers>
&& git rev-parse --verify HEAD
[INFO] Working directory: <https://builds.apache.org/job/Tez-Build-Hadoop-2.4/ws/tez-tools/analyzers>
[INFO] Storing buildScmBranch: UNKNOWN
[INFO] 
[INFO] --- build-helper-maven-plugin:1.8:maven-version (maven-version) @ tez-perf-analyzer
---
[INFO]                                                                         
[INFO] ------------------------------------------------------------------------
[INFO] Building tez-job-analyzer 0.8.1-SNAPSHOT
[INFO] ------------------------------------------------------------------------
[INFO] 
[INFO] --- maven-clean-plugin:2.5:clean (default-clean) @ tez-job-analyzer ---
[INFO] Deleting <https://builds.apache.org/job/Tez-Build-Hadoop-2.4/ws/tez-tools/analyzers/job-analyzer/target>
[INFO] 
[INFO] --- buildnumber-maven-plugin:1.1:create (default) @ tez-job-analyzer ---
[INFO] Checking for local modifications: skipped.
[INFO] Updating project files from SCM: skipped.
[INFO] Executing: /bin/sh -c cd <https://builds.apache.org/job/Tez-Build-Hadoop-2.4/ws/tez-tools/analyzers/job-analyzer>
&& git rev-parse --verify HEAD
[INFO] Working directory: <https://builds.apache.org/job/Tez-Build-Hadoop-2.4/ws/tez-tools/analyzers/job-analyzer>
[INFO] Storing buildNumber: ffa3d5208dcd37f990273799d1dd60176e303568 at timestamp: 1442290738613
[INFO] Executing: /bin/sh -c cd <https://builds.apache.org/job/Tez-Build-Hadoop-2.4/ws/tez-tools/analyzers/job-analyzer>
&& git rev-parse --verify HEAD
[INFO] Working directory: <https://builds.apache.org/job/Tez-Build-Hadoop-2.4/ws/tez-tools/analyzers/job-analyzer>
[INFO] Storing buildScmBranch: UNKNOWN
[INFO] 
[INFO] --- build-helper-maven-plugin:1.8:maven-version (maven-version) @ tez-job-analyzer
---
[INFO] 
[INFO] --- maven-resources-plugin:2.6:resources (default-resources) @ tez-job-analyzer ---
[INFO] Using 'UTF-8' encoding to copy filtered resources.
[INFO] skip non existing resourceDirectory <https://builds.apache.org/job/Tez-Build-Hadoop-2.4/ws/tez-tools/analyzers/job-analyzer/src/main/resources>
[INFO] 
[INFO] --- maven-compiler-plugin:3.1:compile (default-compile) @ tez-job-analyzer ---
[INFO] Changes detected - recompiling the module!
[INFO] Compiling 18 source files to <https://builds.apache.org/job/Tez-Build-Hadoop-2.4/ws/tez-tools/analyzers/job-analyzer/target/classes>
[INFO] 
[INFO] --- maven-resources-plugin:2.6:testResources (default-testResources) @ tez-job-analyzer
---
[INFO] Using 'UTF-8' encoding to copy filtered resources.
[INFO] skip non existing resourceDirectory <https://builds.apache.org/job/Tez-Build-Hadoop-2.4/ws/tez-tools/analyzers/job-analyzer/src/test/resources>
[INFO] 
[INFO] --- maven-compiler-plugin:3.1:testCompile (default-testCompile) @ tez-job-analyzer
---
[INFO] Changes detected - recompiling the module!
[INFO] Compiling 1 source file to <https://builds.apache.org/job/Tez-Build-Hadoop-2.4/ws/tez-tools/analyzers/job-analyzer/target/test-classes>
[INFO] 
[INFO] --- maven-surefire-plugin:2.14.1:test (default-test) @ tez-job-analyzer ---
[INFO] Surefire report directory: <https://builds.apache.org/job/Tez-Build-Hadoop-2.4/ws/tez-tools/analyzers/job-analyzer/target/surefire-reports>

-------------------------------------------------------
 T E S T S
-------------------------------------------------------

-------------------------------------------------------
 T E S T S
-------------------------------------------------------
Running org.apache.tez.analyzer.TestAnalyzer
Tests run: 13, Failures: 2, Errors: 0, Skipped: 0, Time elapsed: 96.94 sec <<< FAILURE!
testBasicInputFailureWithoutExit(org.apache.tez.analyzer.TestAnalyzer)  Time elapsed: 6.268
sec  <<< FAILURE!
java.lang.AssertionError: v2 : 000000_0
	at org.junit.Assert.fail(Assert.java:88)
	at org.junit.Assert.assertTrue(Assert.java:41)
	at org.apache.tez.analyzer.TestAnalyzer.verifyCriticalPath(TestAnalyzer.java:273)
	at org.apache.tez.analyzer.TestAnalyzer.runDAGAndVerify(TestAnalyzer.java:220)
	at org.apache.tez.analyzer.TestAnalyzer.testBasicInputFailureWithoutExit(TestAnalyzer.java:399)

testCascadingInputFailureWithExitSuccess(org.apache.tez.analyzer.TestAnalyzer)  Time elapsed:
5.994 sec  <<< FAILURE!
java.lang.AssertionError: v3 : 000000_1
	at org.junit.Assert.fail(Assert.java:88)
	at org.junit.Assert.assertTrue(Assert.java:41)
	at org.apache.tez.analyzer.TestAnalyzer.verifyCriticalPath(TestAnalyzer.java:273)
	at org.apache.tez.analyzer.TestAnalyzer.runDAGAndVerify(TestAnalyzer.java:220)
	at org.apache.tez.analyzer.TestAnalyzer.testCascadingInputFailureWithExitSuccess(TestAnalyzer.java:561)


Results :

Failed tests: 
  TestAnalyzer.testBasicInputFailureWithoutExit:399->runDAGAndVerify:220->verifyCriticalPath:273
v2 : 000000_0
  TestAnalyzer.testCascadingInputFailureWithExitSuccess:561->runDAGAndVerify:220->verifyCriticalPath:273
v3 : 000000_1

Tests run: 13, Failures: 2, Errors: 0, Skipped: 0

[INFO]                                                                         
[INFO] ------------------------------------------------------------------------
[INFO] Building tez-javadoc-tools 0.8.1-SNAPSHOT
[INFO] ------------------------------------------------------------------------
[INFO] 
[INFO] --- maven-clean-plugin:2.5:clean (default-clean) @ tez-javadoc-tools ---
[INFO] Deleting <https://builds.apache.org/job/Tez-Build-Hadoop-2.4/ws/tez-tools/tez-javadoc-tools/target>
[INFO] 
[INFO] --- buildnumber-maven-plugin:1.1:create (default) @ tez-javadoc-tools ---
[INFO] Checking for local modifications: skipped.
[INFO] Updating project files from SCM: skipped.
[INFO] Executing: /bin/sh -c cd <https://builds.apache.org/job/Tez-Build-Hadoop-2.4/ws/tez-tools/tez-javadoc-tools>
&& git rev-parse --verify HEAD
[INFO] Working directory: <https://builds.apache.org/job/Tez-Build-Hadoop-2.4/ws/tez-tools/tez-javadoc-tools>
[INFO] Storing buildNumber: ffa3d5208dcd37f990273799d1dd60176e303568 at timestamp: 1442290836244
[INFO] Executing: /bin/sh -c cd <https://builds.apache.org/job/Tez-Build-Hadoop-2.4/ws/tez-tools/tez-javadoc-tools>
&& git rev-parse --verify HEAD
[INFO] Working directory: <https://builds.apache.org/job/Tez-Build-Hadoop-2.4/ws/tez-tools/tez-javadoc-tools>
[INFO] Storing buildScmBranch: UNKNOWN
[INFO] 
[INFO] --- build-helper-maven-plugin:1.8:maven-version (maven-version) @ tez-javadoc-tools
---
[INFO] 
[INFO] --- maven-resources-plugin:2.6:resources (default-resources) @ tez-javadoc-tools ---
[INFO] Using 'UTF-8' encoding to copy filtered resources.
[INFO] skip non existing resourceDirectory <https://builds.apache.org/job/Tez-Build-Hadoop-2.4/ws/tez-tools/tez-javadoc-tools/src/main/resources>
[INFO] 
[INFO] --- maven-compiler-plugin:3.1:compile (default-compile) @ tez-javadoc-tools ---
[INFO] Changes detected - recompiling the module!
[INFO] Compiling 6 source files to <https://builds.apache.org/job/Tez-Build-Hadoop-2.4/ws/tez-tools/tez-javadoc-tools/target/classes>
[INFO] 
[INFO] --- maven-resources-plugin:2.6:testResources (default-testResources) @ tez-javadoc-tools
---
[INFO] Using 'UTF-8' encoding to copy filtered resources.
[INFO] skip non existing resourceDirectory <https://builds.apache.org/job/Tez-Build-Hadoop-2.4/ws/tez-tools/tez-javadoc-tools/src/test/resources>
[INFO] 
[INFO] --- maven-compiler-plugin:3.1:testCompile (default-testCompile) @ tez-javadoc-tools
---
[INFO] No sources to compile
[INFO] 
[INFO] --- maven-surefire-plugin:2.14.1:test (default-test) @ tez-javadoc-tools ---
[INFO] No tests to run.
[INFO]                                                                         
[INFO] ------------------------------------------------------------------------
[INFO] Building tez-dist 0.8.1-SNAPSHOT
[INFO] ------------------------------------------------------------------------
[INFO] 
[INFO] --- maven-clean-plugin:2.5:clean (default-clean) @ tez-dist ---
[INFO] 
[INFO] --- buildnumber-maven-plugin:1.1:create (default) @ tez-dist ---
[INFO] Checking for local modifications: skipped.
[INFO] Updating project files from SCM: skipped.
[INFO] Executing: /bin/sh -c cd <https://builds.apache.org/job/Tez-Build-Hadoop-2.4/ws/tez-dist>
&& git rev-parse --verify HEAD
[INFO] Working directory: <https://builds.apache.org/job/Tez-Build-Hadoop-2.4/ws/tez-dist>
[INFO] Storing buildNumber: ffa3d5208dcd37f990273799d1dd60176e303568 at timestamp: 1442290836338
[INFO] Executing: /bin/sh -c cd <https://builds.apache.org/job/Tez-Build-Hadoop-2.4/ws/tez-dist>
&& git rev-parse --verify HEAD
[INFO] Working directory: <https://builds.apache.org/job/Tez-Build-Hadoop-2.4/ws/tez-dist>
[INFO] Storing buildScmBranch: UNKNOWN
[INFO] 
[INFO] --- build-helper-maven-plugin:1.8:maven-version (maven-version) @ tez-dist ---
[INFO]                                                                         
[INFO] ------------------------------------------------------------------------
[INFO] Building Tez 0.8.1-SNAPSHOT
[INFO] ------------------------------------------------------------------------
[INFO] 
[INFO] --- maven-clean-plugin:2.5:clean (default-clean) @ tez-docs ---
[INFO] 
[INFO] --- buildnumber-maven-plugin:1.1:create (default) @ tez-docs ---
[INFO] Checking for local modifications: skipped.
[INFO] Updating project files from SCM: skipped.
[INFO] Executing: /bin/sh -c cd <https://builds.apache.org/job/Tez-Build-Hadoop-2.4/ws/docs>
&& git rev-parse --verify HEAD
[INFO] Working directory: <https://builds.apache.org/job/Tez-Build-Hadoop-2.4/ws/docs>
[INFO] Storing buildNumber: ffa3d5208dcd37f990273799d1dd60176e303568 at timestamp: 1442290836352
[INFO] Executing: /bin/sh -c cd <https://builds.apache.org/job/Tez-Build-Hadoop-2.4/ws/docs>
&& git rev-parse --verify HEAD
[INFO] Working directory: <https://builds.apache.org/job/Tez-Build-Hadoop-2.4/ws/docs>
[INFO] Storing buildScmBranch: UNKNOWN
[INFO] 
[INFO] --- build-helper-maven-plugin:1.8:maven-version (maven-version) @ tez-docs ---
[INFO] ------------------------------------------------------------------------
[INFO] Reactor Summary:
[INFO] 
[INFO] tez ............................................... SUCCESS [  1.192 s]
[INFO] tez-api ........................................... SUCCESS [ 43.723 s]
[INFO] tez-common ........................................ SUCCESS [  3.930 s]
[INFO] tez-runtime-internals ............................. SUCCESS [ 12.346 s]
[INFO] tez-runtime-library ............................... SUCCESS [02:11 min]
[INFO] tez-mapreduce ..................................... SUCCESS [ 28.899 s]
[INFO] tez-examples ...................................... SUCCESS [  0.288 s]
[INFO] tez-dag ........................................... SUCCESS [02:09 min]
[INFO] tez-tests ......................................... SUCCESS [27:06 min]
[INFO] tez-ext-service-tests ............................. SUCCESS [ 58.573 s]
[INFO] tez-ui ............................................ SUCCESS [ 16.542 s]
[INFO] tez-plugins ....................................... SUCCESS [  0.015 s]
[INFO] tez-yarn-timeline-history ......................... SUCCESS [ 52.987 s]
[INFO] tez-history-parser ................................ SUCCESS [01:46 min]
[INFO] tez-tools ......................................... SUCCESS [  0.014 s]
[INFO] tez-perf-analyzer ................................. SUCCESS [  0.017 s]
[INFO] tez-job-analyzer .................................. FAILURE [01:37 min]
[INFO] tez-javadoc-tools ................................. SUCCESS [  0.154 s]
[INFO] tez-dist .......................................... SUCCESS [  0.014 s]
[INFO] Tez ............................................... SUCCESS [  0.015 s]
[INFO] ------------------------------------------------------------------------
[INFO] BUILD FAILURE
[INFO] ------------------------------------------------------------------------
[INFO] Total time: 38:30 min
[INFO] Finished at: 2015-09-15T04:20:36+00:00
[INFO] Final Memory: 44M/627M
[INFO] ------------------------------------------------------------------------
[ERROR] Failed to execute goal org.apache.maven.plugins:maven-surefire-plugin:2.14.1:test
(default-test) on project tez-job-analyzer: There are test failures.
[ERROR] 
[ERROR] Please refer to <https://builds.apache.org/job/Tez-Build-Hadoop-2.4/ws/tez-tools/analyzers/job-analyzer/target/surefire-reports>
for the individual test results.
[ERROR] -> [Help 1]
[ERROR] 
[ERROR] To see the full stack trace of the errors, re-run Maven with the -e switch.
[ERROR] Re-run Maven using the -X switch to enable full debug logging.
[ERROR] 
[ERROR] For more information about the errors and possible solutions, please read the following
articles:
[ERROR] [Help 1] http://cwiki.apache.org/confluence/display/MAVEN/MojoFailureException
[ERROR] 
[ERROR] After correcting the problems, you can resume the build with the command
[ERROR]   mvn <goals> -rf :tez-job-analyzer
Build step 'Execute shell' marked build as failure
Recording test results

Mime
View raw message